{"text_format":"1","workbook":"xlsx","n_sheets":7,"sheets":["Intro","Country Data_EU","Methodology Note","Bribery","EU","General stats","Q3"],"not_rendered":{"charts":10,"images":4,"macros":1,"external_links":1,"defined_names":104,"comments":2,"pivot_tables":4},"unopened":[],"bounds":{"document_bytes":16777216,"sheet_cells":100000,"rows_first":2000,"rows_last":500,"rows_between":2000,"halvings":0,"cell_chars":16384,"cell_head_chars":4096},"cells_cut":0,"cells_raw":0,"read":"whole","date_system":"1900"}

{"sheet":"Intro","index":0,"n_rows":17,"n_cols":14,"rows_kept":17,"cut":false,"hidden":true,"merged":[[4,1,4,5]]}
[]
[]
["GLOBAL CORRUPTION BAROMETER 2016"]
[]
[null,"Regions and country coverage"]
[]
[]
[]
[]
[]
[]
[]
[]
[]
[]
[]
[null,null,null,null,null,null,null,null,null,null,null,null,null,"                                                                                                                                                                                                                                                                                                                                                                                                                                             "]

{"sheet":"Country Data_EU","index":1,"n_rows":113,"n_cols":24,"rows_kept":113,"cut":false,"hidden":false,"merged":[[2,0,2,6],[2,7,2,17],[4,9,4,14]]}
["Montenegro"]
[]
["SUMMARY OF RESULTS",null,null,null,null,null,null,"COUNTRY CHARTS"]
[]
["Montenegro",null,null,null,null,null,null,null,0.16,"of service users paid a bribe to at least one of eight public services in the past 12 months."]
["Q1 (Figure 1): How many of the following people do you think are involved in corruption, or haven't you heard enough about them to say?","None","Some of them","Most of them","All of them","DK/ Haven't heard"]
["The President/Prime Minister and Officials in his Office",0.11,0.13,0.1,0.08,0.57999999999999996]
["Members of Parliament",0.08,0.17,0.11,7.0000000000000007E-2,0.56999999999999995]
["Government officials",0.08,0.16,0.12,0.08,0.56000000000000005]
["Local government representatives",0.08,0.19,0.1,0.08,0.55000000000000004]
["Tax officials",7.0000000000000007E-2,0.2,0.1,0.08,0.55000000000000004]
["Police",7.0000000000000007E-2,0.21,0.12,7.0000000000000007E-2,0.53]
["Judges and Magistrates",7.0000000000000007E-2,0.22,0.11,0.06,0.53]
["Business executives",0.08,0.19,0.11,0.09,0.53]
["Religious leaders",0.14000000000000001,0.14000000000000001,0.06,0.06,0.61]
[]
["Q2 (Figure 2)","Strongly disagree","Disagree","Neither disagree nor agree","Agree","Strongly agree","DK/ Not applicable"]
["There is less corruption now than around 4 years ago",0.14000000000000001,0.32,0.24,0.14000000000000001,0.04,0.13]
[]
["Q3 (Figure 3): In the past twelve months have you had contact with / did you try to get / requested assistence from...?  ","Had contact ","% of service users who paid a bribe "]
["Medical treatment in the public health system",0.45,0.15]
["Road police",0.23,0.11]
["Public education (primary or secondary)",0.17,0.08]
["Public education (vocation)",0.15,7.0000000000000007E-2]
["Official documents from authorities",0.23,0.05]
["Social security benefits",0.03,"*",null,null,null,null,null,null,null,null,null,null,null,null,null,null,null,null,null,null,"Figure 2"]
["Unemployment benefits",0.02,"*",null,null,null,null,null,null,null,null,null,null,null,null,null,null,null,null,null,null,"Change in level","% respondents"]
["Courts for a civil matter",0.02,"*",null,null,null,null,null,null,null,null,null,null,null,null,null,null,null,null,null,null,null,"Disagree",0.46]
["*this result has been removed due to a low base size of less than 60 respondents\n",null,null,null,null,null,null,null,null,null,null,null,null,null,null,null,null,null,null,null,null,null,"Neither agree nor disagree",0.24]
[null,null,null,null,null,null,null,null,null,null,null,null,null,null,null,null,null,null,null,null,null,null,"Agree",0.18000000000000002]
["Q3 - TOTAL BRIBES (Base. All service users)","Yes","No"]
["Paid a bribe for at least one of eight public services",0.16,0.84]
[]
["Q4: Based on your experience, what do you think is the main reason why many people do not report corruption when it occurs?","% of respondents"]
["People are afraid of the consequences",0.33]
["Corruption is hidden/ it’s difficult to prove",0.19,null,null,null,null,null,null,null,null,null,null,null,null,null,null,null,null,null,null,null,null,"Badly",0.5]
["Nothing will be done / It wouldn’t make a difference",0.1,null,null,null,null,null,null,null,null,null,null,null,null,null,null,null,null,null,null,null,null,"Well",0.16999999999999998]
["Because they would implicate themselves as bribe-givers",0.05]
["People don’t know how to report it",0.03]
["People don’t know where to report it",0.03]
["The officials where they would report to are also corrupt / officials are involved in the corruption",0.02]
["Most people do report incidents of corruption",0.02,null,null,null,null,null,null,null,null,null,null,null,null,null,null,null,null,null,null,null,null,"Ordinary people can make a difference in the fight against corruption"]
["Corruption is normal / Everyone does it / everyone is involved",0.01,null,null,null,null,null,null,null,null,null,null,null,null,null,null,null,null,null,null,null,null,"Agree",0.30000000000000004]
["It’s government’s money, not the people’s, so it’s not our problem",0.01]
["People don’t have enough time to report it",0.01]
["It’s too expensive to report (e.g. due to travel or phone charges)",0]
["Refusal",0.05]
["Other",0]
["Don’t know",0.15]
[]
["Q5 (Figure 4): In your opinion, what are the most important problems facing this country that the government should address?","% of respondents"]
["Unemployment",0.68,null,null,null,null,null,null,null,null,null,null,null,null,null,null,null,null,null,null,null,null,"Badly",{"$error":"#REF!"}]
["Crime",0.42]
["Health",0.41]
["The economy",0.31]
["Corruption/Bribery",0.31]
["Education",0.2]
["Environment",0.08]
["Political instability/Security",0.08]
["Infrastructure",7.0000000000000007E-2]
["Immigration",0.01]
["No Problems",0]
["Other",0.01]
["Don’t Know",0.03]
[]
["Q6 (Figure 5): How well or badly would you say the current government is handling…","Very badly","Fairly badly","Fairly well","Very well","DK ","Haven't heard enough"]
["Fighting corruption in government",0.17,0.33,0.15,0.02,0.12,0.19]
[]
["Q7 (Figure 6): Please tell me whether you agree or disagree with the following statement:","Strongly agree","Agree","Neither","Disagree","Strongly disagree","DK"]
["Ordinary people can make a difference in the fight against corruption",7.0000000000000007E-2,0.23,0.23,0.17,0.12,0.12]
["In our society it is generally acceptable for people to report a case of corruption they have witnessed ",0.02,0.08,0.26,0.27,0.17,0.16]
["If I would witness an act of corruption, I would feel personally obliged to report it",7.0000000000000007E-2,0.28000000000000003,0.28000000000000003,0.13,0.05,0.13]
["I would report a case of corruption even if I would have to spend a day in court to give evidence",0.06,0.21,0.27,0.15,0.08,0.16]
[]
["Q8 (Figure 7): What is the most effective thing that an ordinary person like you can do to help combat corruption in this country?","% of respondents"]
["Ordinary people cannot do anything ",0.25]
["Report corruption when you see or experience it",0.2]
["Refuse to pay bribes",0.18]
["Speak out about the problem",0.04]
["Talk to friends and relatives ",0.04]
["Join or support an anti-corruption organization",0.04]
["Vote for clean candidates or parties",0.03]
["Sign a petition",0.03,null,null,null,null,null,null,null,null,null,null,null,null,null,null,null,null,null,null,null,0.4]
["Participate in protest marches or demonstrations",0.01]
["Boycott a corrupt business",0.01]
["Other",0]
["Don't know",0.11]
[]
["Q9 (Figure 8): How would you place your views on this scale? ","% of respondents"]
["1 - There is no problem with the influence of wealthy individuals on the way government is run in this country",0.08]
[2,0.02]
[3,0.03,null,null,null,null,null,null,null,null,null,null,null,null,null,null,null,null,null,null,null,0.47999999999999993]
[4,0.03]
[5,0.06]
[6,0.1]
[7,0.05]
[8,0.05]
[9,0.06]
["10 - Wealthy individuals often use their influence on government for their own interests and there need to be stricter rules to prevent this. ",0.24]
["Don't know",0.28000000000000003]
[]
["Q9 (Figure 9): How would you place your views on this scale? ","% of respondents"]
["1 - Financial support by companies to political parties and candidates should be banned completely",0.36]
[2,0.04]
[3,0.04]
[4,0.04]
[5,7.0000000000000007E-2]
[6,0.12]
[7,0.05]
[8,0.03]
[9,0.03]
["10 - There should be no limits on financial support by companies to political parties or candidates",7.0000000000000007E-2]
["Don't know",0.16]

{"sheet":"Methodology Note","index":2,"n_rows":37,"n_cols":5,"rows_kept":37,"cut":false,"hidden":false,"merged":[[1,0,1,4],[11,0,11,4],[20,0,20,4],[3,0,8,4],[18,0,18,4]]}
["Montenegro"]
["BACKGROUND"]
[]
["This survey forms part of the Global Corruption Barometer 2016. This spreadsheet contains survey data collected by TNS. This survey has been conducted face to face using a Computer-assisted personal interviewing (CAPI) approach. The sample was distributed across the regions of the country proportionate to population size. Respondents were selected at random from all adult members of their household. The sample is weighted to be nationally representative. Every effort has been made to provide accurate information. All results are based on a sample and are therefore subject to statistical errors normally associated with sample-based information. For further information about the results in this spreadsheet, please contact Coralie Pring Research Coordinator Transparency International (+49)(0)303420416 or email coralie.pring@transparency.org."]
[]
[]
[]
[]
[]
[]
["EDITOR'S NOTES - all press releases should contain the following information"]
["All figures, unless otherwise stated, are from Transparency International GCB 2016. The survey was carried out face to face using a Computer-assisted personal interviewing (CAPI) approach by TNS. The figures are weighted and are representative of all adults (aged 18+)."]
[]
["Total sample size: ",1503,"adults"]
["Fieldwork was undertaken between: ","2015-11-28","and","2016-03-07"]
[]
["NOTE: All press releases or other publications must be checked by Transparency International Secretariat before use. "]
[]
["Any percentages calculated on bases fewer than 60 respondents must not be reported as they do not represent a wide enough cross-section of the target population to be considered statistically reliable."]
[]
["SUMMARY STATISTICS OF NATIONAL SAMPLE (WEIGHTED)"]
[]
["GENDER","% sample",null,"AGE","% sample"]
["Male",0.48619930341727197,null,"18 - 24",0.12753264932988578]
["Female",0.51380069658273486,null,"25 - 34",0.2067608014056054]
[null,null,null,"35 - 54",0.33966780124623219]
["RURAL/URBAN","% sample",null,"55+",0.32603874801828181]
["Rural",0.4639832254981342]
["Urban",0.5360167745018739,null,"EDUCATION","% sample"]
[null,null,null,"No degree/No education",0.01]
["MARITAL STATUS","% sample",null,"Primary education",0.11]
["Single (never married)",0.31,null,"Lower secondary education",0.13]
["Married",0.55000000000000004,null,"(Upper) secondary education",0.44]
["Widowed",0.1,null,"Post-secondary non-tertiary education",0.08]
["Divorced",0.04,null,"Tertiary education (not a university diploma)",0.06]
["Separated",0,null,"Bachelor's degree or more",0.14000000000000001]
[null,null,null,"Master's degree or PhD",0.03]

{"sheet":"Bribery","index":3,"n_rows":401,"n_cols":11,"rows_kept":401,"cut":false,"hidden":true,"merged":[]}
["BRIBERY QUESTIONS"]
[]
["QUESTION 3A","Road police"]
["Interact with the road police","% who had contact","% who paid a bribe"]
["Albania",0.14000000000000001,0.3]
["Armenia",0.31,0.22]
["Azerbaijan",0.1,0.34]
["Belarus",0.19,0.18]
["Bosnia and Herz.",0.36,0.24]
["Bulgaria",0.18,0.13]
["Croatia",0.27,0.06]
["Cyprus",0.14000000000000001,0]
["Czech Rep.",0.27,0.03]
["Estonia",0.25,0.01]
["FYR Macedonia",0,0]
["Georgia",0.08,0.04]
["Germany",0.12,0.04]
["Greece",0.06,0]
["Hungary",0.16,0.03]
["Italy",0.12,0.02]
["Kazakhstan",0.19,0.47]
["Kosovo",0.17,0.06]
["Kyrgyz Rep.",0.23,0.48]
["Latvia",0.26,0.11]
["Lithuania",0.25,0.06]
["Moldova",0,0]
["Mongolia",0.23,0.16]
["Montenegro",0.23,0.11]
["Poland",0.19,0.05]
["Romania",0.1,0.09]
["Russia",0.28999999999999998,0.26]
["Serbia",0.22,0.31]
["Slovak Rep.",0.27,0.05]
["Slovenia",0.13,0.01]
["Tajikistan",0.15,0.64]
["Turkey",0.05,0.11]
["Ukraine",0,0]
[]
[]
[]
[]
[]
[]
[]
[]
[]
["QUESTION 3B","Official documents"]
["Request official documents (e.g. passport, visa, birth or marriage certificate, land register, etc.) from authorities","% who had contact","% who paid a bribe"]
["Albania",0.3,0.14000000000000001]
["Armenia",0.22,0.06]
["Azerbaijan",0.14000000000000001,0.16]
["Belarus",0.22,0.05]
["Bosnia and Herz.",0.37,0.08]
["Bulgaria",0.13,0.02]
["Croatia",0.28000000000000003,0.03]
["Cyprus",0.18,0.02]
["Czech Rep.",0.21,0.04]
["Estonia",0.38,0.01]
["FYR Macedonia",0,0]
["Georgia",0.14000000000000001,7.0000000000000007E-2]
["Germany",0.13,0.01]
["Greece",0.16,0.03]
["Hungary",0.16,0.02]
["Italy",0.2,0.05]
["Kazakhstan",0.18,0.19]
["Kosovo",0.41,0.05]
["Kyrgyz Rep.",0.26,0.24]
["Latvia",0.33,0.01]
["Lithuania",0.26,0.01]
["Moldova",0,0]
["Mongolia",0.17,0.11]
["Montenegro",0.23,0.05]
["Poland",0.15,0.01]
["Romania",0.08,0.04]
["Russia",0.14000000000000001,0.12]
["Serbia",0.21,0.12]
["Slovak Rep.",0.18,7.0000000000000007E-2]
["Slovenia",0.2,0.01]
["Tajikistan",0.21,0.47]
["Turkey",0.1,0.12]
["Ukraine",0,0]
[]
[]
[]
[]
[]
[]
[]
[]
[]
[]
["QUESTION 3C","Courts",null,null,null,null,null,null,null,null,"Insert into Country Data if necessary:"]
["Go to courts for a civil matter","% who had contact","% who paid a bribe",null,"More than 60 respondents?",null,null,"Old results",null,null,"*this result has been removed due to a low base size of less than 60 respondents"]
["Albania",7.0000000000000007E-2,0.18,null,98]
["Armenia",0.02,null,null,33,null,null,0.02,0.06]
["Azerbaijan",0.03,null,null,45,null,null,0.03,0.19]
["Belarus",0.04,null,null,58,null,null,0.04,0.04]
["Bosnia and Herz.",0.03,null,null,41,null,null,0.03,0.37]
["Bulgaria",0.03,null,null,47,null,null,0.03,0.05]
["Croatia",0.05,0.01,null,77]
["Cyprus",0.08,0.03,null,118]
["Czech Rep.",0.03,null,null,40,null,null,0.03,0]
["Estonia",0.01,null,null,19,null,null,0.01,0]
["FYR Macedonia",0,0,null,0]
["Georgia",0.02,null,null,33,null,null,0.02,7.0000000000000007E-2]
["Germany",0.04,null,null,57,null,null,0.04,0]
["Greece",0.03,null,null,44,null,null,0.03,0.01]
["Hungary",0.03,null,null,38,null,null,0.03,0.11]
["Italy",0.04,7.0000000000000007E-2,null,65]
["Kazakhstan",0.05,0.31,null,71]
["Kosovo",0.03,null,null,52,null,null,0.03,0.03]
["Kyrgyz Rep.",0.05,0.36,null,68]
["Latvia",0.03,null,null,46,null,null,0.03,0.03]
["Lithuania",0.03,null,null,49,null,null,0.03,0.02]
["Moldova",0,0,null,0]
["Mongolia",0.03,null,null,44,null,null,0.03,0.3]
["Montenegro",0.02,null,null,33,null,null,0.02,0.14000000000000001]
["Poland",0.04,null,null,59,null,null,0.04,0.02]
["Romania",0.03,null,null,45,null,null,0.03,0.09]
["Russia",0.02,null,null,33,null,null,0.02,0.08]
["Serbia",0.03,null,null,50,null,null,0.03,0.28000000000000003]
["Slovak Rep.",0.02,null,null,37,null,null,0.02,0.14000000000000001]
["Slovenia",0.08,0.04,null,119]
["Tajikistan",0.03,null,null,39,null,null,0.03,0.35]
["Turkey",0.06,0.2,null,90]
["Ukraine",0,0,null,0]
[]
[]
[]
[]
[]
[]
[]
["QUESTION 3D","Public education (primary or secondary)"]
["Receive public education (primary or secondary)","% who had contact","% who paid a bribe"]
["Albania",0.2,0.17]
["Armenia",0.09,0.11]
["Azerbaijan",0.11,0.18]
["Belarus",0.14000000000000001,0.18]
["Bosnia and Herz.",0.21,0.06]
["Bulgaria",0.12,7.0000000000000007E-2]
["Croatia",0.18,0.02]
["Cyprus",0.15,0.01]
["Czech Rep.",0.06,0.03]
["Estonia",0.15,0.04]
["FYR Macedonia",0,0]
["Georgia",0.13,0.04]
["Germany",0.08,0]
["Greece",0.15,0]
["Hungary",0.14000000000000001,7.0000000000000007E-2]
["Italy",0.2,0.02]
["Kazakhstan",0.17,0.17]
["Kosovo",0.24,0.02]
["Kyrgyz Rep.",0.25,0.13]
["Latvia",0.14000000000000001,0.04]
["Lithuania",0.1,0.05]
["Moldova",0,0]
["Mongolia",0.25,0.1]
["Montenegro",0.17,0.08]
["Poland",0.18,0.02]
["Romania",0.12,0.23]
["Russia",0.14000000000000001,0.28999999999999998]
["Serbia",0.16,0.06]
["Slovak Rep.",0.18,0.01]
["Slovenia",0.2,0]
["Tajikistan",0.19,0.26]
["Turkey",0.13,0.17]
["Ukraine",0,0]
[]
[]
[]
[]
[]
[]
[]
["QUESTION 3E","Public education (vocation)"]
["Receive public education (vocation)","% who had contact","% who paid a bribe",null,"More than 60 respondents?",null,null,"Old results"]
["Albania",0.15,0.14000000000000001,null,225]
["Armenia",0.01,null,null,16,null,null,0.01,0.03]
["Azerbaijan",0.08,0.24,null,122]
["Belarus",0.1,0.09,null,143]
["Bosnia and Herz.",0.14000000000000001,0.08,null,212]
["Bulgaria",7.0000000000000007E-2,0.15,null,105]
["Croatia",0.13,0.01,null,188]
["Cyprus",0.02,null,null,30,null,null,0.02,0]
["Czech Rep.",0.04,null,null,55,null,null,0.04,0.02]
["Estonia",0.05,0,null,80]
["FYR Macedonia",0,0,null,0]
["Georgia",0.05,0.17,null,71]
["Germany",7.0000000000000007E-2,0,null,99]
["Greece",0.04,0,null,61]
["Hungary",0.06,0.04,null,89]
["Italy",0.06,0,null,92]
["Kazakhstan",0.1,0.23,null,144]
["Kosovo",0.17,0.02,null,259]
["Kyrgyz Rep.",0.12,0.23,null,177]
["Latvia",0.05,0,null,72]
["Lithuania",0.02,null,null,37,null,null,0.02,0.09]
["Moldova",0,0,null,0]
["Mongolia",0.08,0.08,null,119]
["Montenegro",0.15,7.0000000000000007E-2,null,220]
["Poland",0.13,0.04,null,188]
["Romania",0.08,0.11,null,116]
["Russia",0.09,0.24,null,142]
["Serbia",0.11,0.04,null,160]
["Slovak Rep.",0.1,0.04,null,156]
["Slovenia",0.12,0.03,null,174]
["Tajikistan",0.1,0.45,null,149]
["Turkey",0.15,0.18,null,232]
["Ukraine",0,0,null,0]
[]
[]
[]
[]
[]
[]
[]
["QUESTION 3F","Medical treatment"]
["Receive medical treatment in the public health system","% who had contact","% who paid a bribe"]
["Albania",0.52,0.3]
["Armenia",0.6,0.2]
["Azerbaijan",0.25,0.33]
["Belarus",0.6,0.18]
["Bosnia and Herz.",0.56000000000000005,0.2]
["Bulgaria",0.59,0.16]
["Croatia",0.56000000000000005,0.09]
["Cyprus",0.54,0.02]
["Czech Rep.",0.61,0.08]
["Estonia",0.84,0.05]
["FYR Macedonia",0,0]
["Georgia",0.48,0.04]
["Germany",0.55000000000000004,0.02]
["Greece",0.48,0.13]
["Hungary",0.63,0.22]
["Italy",0.62,0.05]
["Kazakhstan",0.48,0.2]
["Kosovo",0.69,0.08]
["Kyrgyz Rep.",0.47,0.26]
["Latvia",0.84,0.13]
["Lithuania",0.84,0.24]
["Moldova",0,0]
["Mongolia",0.39,0.16]
["Montenegro",0.45,0.15]
["Poland",0.68,0.06]
["Romania",0.46,0.33]
["Russia",0.66,0.26]
["Serbia",0.5,0.14000000000000001]
["Slovak Rep.",0.67,0.11]
["Slovenia",0.78,0.02]
["Tajikistan",0.38,0.46]
["Turkey",0.26,0.12]
["Ukraine",0,0]
[]
[]
[]
[]
[]
[]
[]
[]
[]
[]
[]
[]
[]
["QUESTION 3G","Unemployment benefits"]
["Request unemployment benefits","% who had contact","% who paid a bribe",null,"More than 60 respondents?",null,null,"Old results"]
["Albania",7.0000000000000007E-2,0.2,null,109]
["Armenia",0.05,0.04,null,84]
["Azerbaijan",7.0000000000000007E-2,0.45,null,99]
["Belarus",0.1,0.03,null,150]
["Bosnia and Herz.",0.03,null,null,50,null,null,0.03,0.05]
["Bulgaria",0.04,0.02,null,65]
["Croatia",0.05,0.04,null,70]
["Cyprus",0.12,0.02,null,180]
["Czech Rep.",0.05,0.02,null,74]
["Estonia",7.0000000000000007E-2,0,null,103]
["FYR Macedonia",0,0,null,0]
["Georgia",0.03,null,null,53,null,null,0.03,0.22]
["Germany",0.03,null,null,49,null,null,0.03,0]
["Greece",0.06,0,null,85]
["Hungary",7.0000000000000007E-2,0.02,null,102]
["Italy",0.08,0.06,null,125]
["Kazakhstan",0.05,0.33,null,73]
["Kosovo",0.04,0,null,61]
["Kyrgyz Rep.",7.0000000000000007E-2,0.15,null,100]
["Latvia",0.09,0.02,null,139]
["Lithuania",0.09,0.03,null,134]
["Moldova",0,0,null,0]
["Mongolia",0.01,null,null,14,null,null,0.01,0.1]
["Montenegro",0.02,null,null,37,null,null,0.02,0.04]
["Poland",0.04,null,null,54,null,null,0.04,0]
["Romania",0.01,null,null,22,null,null,0.01,0.05]
["Russia",0.02,null,null,34,null,null,0.02,0.1]
["Serbia",0.04,null,null,56,null,null,0.04,0.15]
["Slovak Rep.",0.08,0.03,null,116]
["Slovenia",0.06,0.03,null,91]
["Tajikistan",0.02,null,null,25,null,null,0.02,0.49]
["Turkey",0.06,0.23,null,91]
["Ukraine",0,0,null,0]
[]
[]
[]
[]
[]
[]
[]
[]
[]
[]
[]
[]
[]
[]
[]
["QUESTION 3H","Other social security benefits"]
["Request other social security benefits","% who had contact","% who paid a bribe",null,"More than 60 respondents?",null,null,"Old results"]
["Albania",0.04,null,null,59,null,null,0.04,0.09]
["Armenia",0.06,0.12,null,97]
["Azerbaijan",0.09,0.33,null,132]
["Belarus",0.15,0.04,null,229]
["Bosnia and Herz.",0.03,null,null,45,null,null,0.03,0.18]
["Bulgaria",0.06,0.04,null,94]
["Croatia",0.05,0.03,null,82]
["Cyprus",0.13,0,null,200]
["Czech Rep.",0.06,0.02,null,90]
["Estonia",0.1,0.03,null,149]
["FYR Macedonia",0,0,null,0]
["Georgia",7.0000000000000007E-2,0.11,null,105]
["Germany",0.06,0,null,83]
["Greece",7.0000000000000007E-2,0,null,106]
["Hungary",0.09,0.05,null,139]
["Italy",0.04,null,null,54,null,null,0.04,0.17]
["Kazakhstan",0.09,0.21,null,130]
["Kosovo",0.03,null,null,43,null,null,0.03,0.12]
["Kyrgyz Rep.",0.11,0.16,null,169]
["Latvia",0.11,0.01,null,169]
["Lithuania",0.09,0.02,null,134]
["Moldova",0,0,null,0]
["Mongolia",0.05,0.03,null,71]
["Montenegro",0.03,null,null,52,null,null,0.03,0.12]
["Poland",0.06,0.02,null,90]
["Romania",0.01,null,null,16,null,null,0.01,0]
["Russia",0.09,0.05,null,134]
["Serbia",0.04,7.0000000000000007E-2,null,65]
["Slovak Rep.",0.06,0.03,null,92]
["Slovenia",0.11,0,null,160]
["Tajikistan",0.01,null,null,12,null,null,0.01,0.09]
["Turkey",7.0000000000000007E-2,0.16,null,103]
["Ukraine",0,0,null,0]
[]
[]
[]
[]
[]
[]
[]
[]
[]
[]
[]
[]
[]
[]
[]
[]
["QUESTION 3","Total Bribery"]
["Total bribery rate","YES","NO"]
["Albania",0.34,0.66]
["Armenia",0.24,0.76]
["Azerbaijan",0.38,0.62]
["Belarus",0.2,0.8]
["Bosnia and Herz.",0.27,0.73]
["Bulgaria",0.17,0.83]
["Croatia",0.1,0.9]
["Cyprus",0.02,0.98]
["Czech Rep.",0.09,0.91]
["Estonia",0.05,0.95]
["FYR Macedonia",0,0]
["Georgia",7.0000000000000007E-2,0.93]
["Germany",0.03,0.97]
["Greece",0.1,0.9]
["Hungary",0.22,0.78]
["Italy",7.0000000000000007E-2,0.93]
["Kazakhstan",0.28999999999999998,0.71]
["Kosovo",0.1,0.9]
["Kyrgyz Rep.",0.38,0.62]
["Latvia",0.15,0.85]
["Lithuania",0.24,0.76]
["Moldova",0,0]
["Mongolia",0.2,0.8]
["Montenegro",0.16,0.84]
["Poland",7.0000000000000007E-2,0.93]
["Romania",0.28999999999999998,0.71]
["Russia",0.34,0.66]
["Serbia",0.22,0.78]
["Slovak Rep.",0.12,0.88]
["Slovenia",0.03,0.97]
["Tajikistan",0.5,0.5]
["Turkey",0.18,0.82]
["Ukraine",0,0]

{"sheet":"EU","index":4,"n_rows":665,"n_cols":18,"rows_kept":665,"cut":false,"hidden":true,"merged":[[34,17,34,21],[333,17,333,25]]}
[1,2,3,4,5,6,7,8,9,10,11,12,13,14,15,16,17]
[null,null,null,null,null,null,null,null,null,null,null,null,null,null,null,null,null,"Q1 WESTERN EUROPE DATABASE"]
["QUESTION 4",null,null,null,null,null,null,null,null,null,null,null,null,null,null,null,null,"Three most important problems"]
["Country","Health","Crime","The economy","Education","Environment","Corruption/ bribery","Immigration ","Political instability/ security","Unemployment","Infrastructure/ transportation, roads","Other","No problems","Don’t know"]
["Albania",0.54,0.36,0.53,0.21,0.05,0.34,0.08,0.04,0.54,7.0000000000000007E-2,0,0,0.01]
["Armenia",0.57999999999999996,0.16,0.27,0.24,0.02,0.37,0.32,0.15,0.64,0.04,0.01,0,0.01]
["Azerbaijan",0.08,0.09,0.08,0.21,0.03,0.21,0.01,0.05,0.59,0.02,0.68,0,0.06]
["Belarus",0.69,0.31,0.84,0.23,0.14000000000000001,0.14000000000000001,0.02,0.11,0.41,0.05,0,0,0.01]
["Bosnia and Herz.",0.2,0.61,0.34,0.12,0.02,0.55000000000000004,0.05,0.27,0.63,0.05,0,0,0.01]
["Bulgaria",0.63,0.38,0.5,0.2,0.03,0.36,0.15,0.11,0.39,0.06,0.01,0,0.01]
["Croatia",0.25,0.4,0.47,0.14000000000000001,0.02,0.51,0.13,0.15,0.66,0.05,0.01,0,0]
["Cyprus",0.49,0.15,0.63,0.19,0.02,0.49,0.12,0.14000000000000001,0.62,0.01,0.05,0,0]
["Czech Rep.",0.32,0.37,0.28000000000000003,0.19,0.15,0.41,0.45,0.15,0.24,0.08,0,0,0]
["Estonia",0.59,0.16,0.47,0.28999999999999998,7.0000000000000007E-2,0.25,0.25,0.23,0.44,0.06,0.01,0.01,0]
["Georgia",0.78,0.18,0.56000000000000005,0.3,0.04,0.12,0.05,0.14000000000000001,0.76,0.05,0,0,0]
["Germany",0.39,0.28999999999999998,0.39,0.42,0.31,0.02,0.69,0.27,0.17,0.02,0.01,0,0]
["Greece",0.44,0.05,0.74,0.2,0.02,0.24,0.36,0.14000000000000001,0.71,0,0.02,0,0]
["Hungary",0.67,0.28999999999999998,0.3,0.19,0.09,0.28000000000000003,0.28999999999999998,0.04,0.46,0.08,0,0.01,0]
["Italy",0.35,0.22,0.35,0.15,0.05,0.28000000000000003,0.48,0.22,0.64,0.09,0.01,0,0]
["Kazakhstan",0.67,0.31,0.49,0.3,0.1,0.37,0.01,0.1,0.43,0.16,0,0,0.01]
["Kosovo",0.41,0.25,0.37,0.14000000000000001,0.02,0.65,0.04,0.15,0.7,0.02,0.01,0,0.01]
["Kyrgyz Rep.",0.67,0.28999999999999998,0.52,0.35,0.08,0.47,0.05,0.09,0.39,0.09,0,0,0]
["Latvia",0.66,0.12,0.46,0.28000000000000003,0.02,0.35,0.16,0.22,0.37,0.18,0.01,0,0.01]
["Lithuania",0.32,0.28999999999999998,0.43,0.19,0.02,0.54,0.22,0.18,0.6,0.03,0.02,0,0.01]
["Mongolia",0.66,0.15,0.46,0.39,0.11,0.27,0.02,0.27,0.46,0.11,0,0,0]
["Montenegro",0.41,0.42,0.31,0.2,0.08,0.31,0.01,0.08,0.68,7.0000000000000007E-2,0.01,0,0.03]
["Poland",0.81,0.22,0.23,0.2,0.09,0.15,0.28000000000000003,0.16,0.46,0.18,0.01,0,0.01]
["Romania",0.71,0.13,0.4,0.47,0.06,0.49,7.0000000000000007E-2,7.0000000000000007E-2,0.18,0.21,0.01,0,0.01]
["Russia",0.56000000000000005,0.23,0.61,0.26,0.08,0.39,0.06,0.14000000000000001,0.26,0.15,0.01,0,0.01]
["Serbia",0.25,0.38,0.5,0.14000000000000001,0.05,0.39,0.13,0.2,0.52,0.08,0,0,0.01]
["Slovak Rep.",0.63,0.13,0.34,0.25,0.13,0.38,0.21,0.1,0.48,0.1,0.01,0,0.01]
["Slovenia",0.21,0.28999999999999998,0.44,0.08,0.05,0.59,0.25,0.24,0.45,7.0000000000000007E-2,0.02,0,0.02]
["Tajikistan",0.46,0.21,0.5,0.37,0.08,0.18,0.42,0.05,0.56000000000000005,0.05,0.02,0,0.01]
["Turkey",0.51,0.35,0.57999999999999996,0.4,0.05,0.22,0.11,0.16,0.28000000000000003,7.0000000000000007E-2,0.01,0,0]
[null,null,null,null,null,null,null,null,null,null,null,null,null,null,null,null,null,"Total involved: most of them and all of them"]
[null,null,null,null,null,null,null,null,null,null,null,null,null,null,null,null,null,"Q2A1 WESTERN EUROPE DATABASE"]
["QUESTION 1","A",null,null,null,null,null,null,null,null,null,null,null,null,null,null,null,"President/Prime Minister and officials in his office"]
["Country","None","Some of them","Most of them","All of them","Don't know","Haven't heard enough to say","Total involved","Don't know + Haven't heard"]
["Albania",7.0000000000000007E-2,0.28000000000000003,0.21,0.15,0.14000000000000001,0.16,0.36,{"$f":"SUM(F39+G39)","v":0.30000000000000004}]
["Armenia",0.05,0.14000000000000001,0.17,0.27,0.02,0.34,0.44000000000000006,{"$f":"SUM(F40+G40)","v":0.36000000000000004}]
["Azerbaijan",0.32,0.14000000000000001,0.08,0.02,0.25,0.2,0.1,0.45]
["Belarus",0.21,0.22,0.14000000000000001,0.04,0.17,0.22,0.18000000000000002,0.39]
["Bosnia and Herz.",0.02,0.21,0.26,0.28000000000000003,0.06,0.18,0.54,0.24]
["Bulgaria",7.0000000000000007E-2,0.16,0.12,0.08,0.17,0.4,0.2,0.57000000000000006]
["Croatia",0.13,0.2,0.12,0.05,0.13,0.37,0.16999999999999998,0.5]
["Cyprus",0.06,0.38,0.15,0.08,0.1,0.24,0.22999999999999998,0.33999999999999997]
["Czech Rep.",0.17,0.37,0.08,0.02,0.08,0.28000000000000003,0.1,0.36000000000000004]
["Estonia",0.16,0.24,0.05,0.01,0.17,0.37,6.0000000000000005E-2,0.54]
["Georgia",0.12,0.12,0.04,0.03,0.41,0.28000000000000003,7.0000000000000007E-2,0.69]
["Germany",0.49,0.24,0.06,0.01,7.0000000000000007E-2,0.13,6.9999999999999993E-2,0.2]
["Greece",0.05,0.37,0.19,0.08,7.0000000000000007E-2,0.24,0.27,0.31]
["Hungary",7.0000000000000007E-2,0.28999999999999998,0.17,0.12,0.09,0.26,0.29000000000000004,0.35]
["Italy",0.2,0.36,0.16,0.06,0.08,0.14000000000000001,0.22,0.22000000000000003]
["Kazakhstan",0.21,0.22,7.0000000000000007E-2,0.04,0.21,0.25,0.11000000000000001,0.45999999999999996]
["Kosovo",0.03,0.28000000000000003,0.26,0.14000000000000001,0.12,0.18,0.4,0.3]
["Kyrgyz Rep.",0.12,0.32,0.24,0.11,0.12,0.08,0.35,0.2]
["Latvia",0.1,0.26,0.1,0.04,0.16,0.35,0.14000000000000001,0.51]
["Lithuania",0.05,0.33,0.1,0.03,0.15,0.34,0.13,0.49]
["Mongolia",0.13,0.37,0.23,0.11,7.0000000000000007E-2,0.09,0.34,0.16]
["Montenegro",0.11,0.13,0.1,0.08,0.22,0.36,0.18,0.57999999999999996]
["Poland",0.21,0.15,0.08,0.01,0.16,0.39,0.09,0.55000000000000004]
["Romania",0.09,0.22,0.2,0.1,0.17,0.22,0.30000000000000004,0.39]
["Russia",0.22,0.2,7.0000000000000007E-2,0.04,0.2,0.27,0.11000000000000001,0.47000000000000003]
["Serbia",0.17,0.19,0.17,0.1,0.12,0.24,0.27,0.36]
["Slovak Rep.",0.02,0.26,0.25,0.14000000000000001,0.12,0.21,0.39,0.32999999999999996]
["Slovenia",0.13,0.41,0.11,0.06,0.11,0.18,0.16999999999999998,0.28999999999999998]
["Tajikistan",0.67,7.0000000000000007E-2,0.02,0.01,7.0000000000000007E-2,0.16,0.03,0.23]
["Turkey",0.19,0.24,0.15,0.23,0.1,0.1,0.38,0.2]
[null,null,null,null,null,null,null,null,null,null,null,null,null,null,null,null,null,"Q2B WESTERN EUROPE DATABASE"]
[null,"B",null,null,null,null,null,null,null,null,null,null,null,null,null,null,null,"Members of the parliament"]
["Country","None","Some of them","Most of them","All of them","Don't know","Haven't heard enough to say","Total involved","Don't know + Haven't heard"]
["Albania",0.01,0.3,0.34,0.21,7.0000000000000007E-2,7.0000000000000007E-2,{"$f":"SUM(D72+E72)","v":0.55000000000000004},{"$f":"SUM(F72+G72)","v":0.14000000000000001}]
["Armenia",0.06,0.16,0.2,0.23,0.02,0.34,{"$f":"SUM(D73+E73)","v":0.43000000000000005},{"$f":"SUM(F73+G73)","v":0.36000000000000004}]
["Azerbaijan",0.24,0.16,0.1,0.02,0.27,0.21,0.12000000000000001,0.48]
["Belarus",0.13,0.27,0.17,0.04,0.17,0.21,0.21000000000000002,0.38]
["Bosnia and Herz.",0.02,0.21,0.28999999999999998,0.25,0.06,0.18,0.54,0.24]
["Bulgaria",0.01,0.23,0.27,0.14000000000000001,0.12,0.23,0.41000000000000003,0.35]
["Croatia",0.05,0.32,0.2,0.08,0.1,0.26,0.28000000000000003,0.36]
["Cyprus",0.01,0.49,0.24,0.08,0.08,0.1,0.32,0.18]
["Czech Rep.",0.02,0.43,0.2,0.05,0.06,0.23,0.25,0.29000000000000004]
["Estonia",0.05,0.43,0.08,0.01,0.15,0.28000000000000003,0.09,0.43000000000000005]
["Georgia",0.09,0.17,0.05,0.04,0.4,0.25,0.09,0.65]
["Germany",0.38,0.36,0.05,0.01,7.0000000000000007E-2,0.13,6.0000000000000005E-2,0.2]
["Greece",0,0.44,0.39,0.1,0.03,0.03,0.49,0.06]
["Hungary",0.04,0.33,0.21,0.11,0.08,0.22,0.32,0.3]
["Italy",0.03,0.43,0.34,0.12,0.05,0.04,0.46,0.09]
["Kazakhstan",0.13,0.27,0.11,0.04,0.21,0.23,0.15,0.44]
["Kosovo",0.01,0.28000000000000003,0.34,0.12,0.11,0.13,0.46,0.24]
["Kyrgyz Rep.",0.04,0.28999999999999998,0.34,0.16,0.1,0.06,0.5,0.16]
["Latvia",0.02,0.42,0.19,0.04,0.12,0.21,0.23,0.32999999999999996]
["Lithuania",0.01,0.38,0.16,0.03,0.13,0.28999999999999998,0.19,0.42]
["Mongolia",0.06,0.38,0.31,0.15,0.04,0.06,0.45999999999999996,0.1]
["Montenegro",0.08,0.17,0.11,7.0000000000000007E-2,0.22,0.35,0.18,0.56999999999999995]
["Poland",7.0000000000000007E-2,0.34,0.14000000000000001,0.02,0.13,0.31,0.16,0.44]
["Romania",0.03,0.2,0.37,0.18,0.12,0.12,0.55000000000000004,0.24]
["Russia",0.09,0.28000000000000003,0.12,7.0000000000000007E-2,0.19,0.26,0.19,0.45]
["Serbia",0.08,0.28999999999999998,0.18,0.09,0.13,0.22,0.27,0.35]
["Slovak Rep.",0.01,0.27,0.28999999999999998,0.15,0.11,0.18,0.43999999999999995,0.28999999999999998]
["Slovenia",0.01,0.52,0.18,0.08,0.09,0.13,0.26,0.22]
["Tajikistan",0.47,0.16,0.05,0.01,0.1,0.21,6.0000000000000005E-2,0.31]
["Turkey",0.14000000000000001,0.28000000000000003,0.25,0.14000000000000001,0.1,0.09,0.39,0.19]
[null,null,null,null,null,null,null,null,null,null,null,null,null,null,null,null,null,"Q2C WESTERN EUROPE DATABASE"]
[null,"C",null,null,null,null,null,null,null,null,null,null,null,null,null,null,null,"Government officials"]
["Country","None","Some of them","Most of them","All of them","Don't know","Haven't heard enough to say","Total involved","Don't know + Haven't heard"]
["Albania",0.02,0.36,0.27,0.18,7.0000000000000007E-2,0.1,{"$f":"SUM(D105+E105)","v":0.45},{"$f":"SUM(F105+G105)","v":0.17}]
["Armenia",0.05,0.15,0.21,0.24,0.02,0.34,{"$f":"SUM(D106+E106)","v":0.44999999999999996},{"$f":"SUM(F106+G106)","v":0.36000000000000004}]
["Azerbaijan",0.22,0.18,0.1,0.02,0.28000000000000003,0.2,0.12000000000000001,0.48000000000000004]
["Belarus",0.08,0.32,0.27,0.05,0.12,0.15,0.32,0.27]
["Bosnia and Herz.",0.02,0.2,0.3,0.25,0.06,0.17,0.55000000000000004,0.23]
["Bulgaria",0.02,0.25,0.21,0.1,0.14000000000000001,0.28999999999999998,0.31,0.43]
["Croatia",0.04,0.34,0.21,7.0000000000000007E-2,0.09,0.25,0.28000000000000003,0.33999999999999997]
["Cyprus",0.01,0.5,0.22,0.08,7.0000000000000007E-2,0.11,0.3,0.18]
["Czech Rep.",0.02,0.43,0.23,0.05,0.06,0.21,0.28000000000000003,0.27]
["Estonia",0.06,0.45,0.06,0.01,0.15,0.27,6.9999999999999993E-2,0.42000000000000004]
["Georgia",0.1,0.18,0.06,0.03,0.4,0.24,0.09,0.64]
["Germany",0.32,0.41,0.05,0.01,7.0000000000000007E-2,0.15,6.0000000000000005E-2,0.22]
["Greece",0.01,0.47,0.33,0.08,0.03,0.08,0.41000000000000003,0.11]
["Hungary",0.05,0.33,0.18,0.1,0.09,0.24,0.28000000000000003,0.32999999999999996]
["Italy",0.03,0.47,0.31,0.09,0.05,0.05,0.4,0.1]
["Kazakhstan",0.08,0.38,0.19,0.05,0.17,0.14000000000000001,0.24,0.31000000000000005]
["Kosovo",0.01,0.28000000000000003,0.32,0.14000000000000001,0.11,0.13,0.46,0.24]
["Kyrgyz Rep.",0.04,0.27,0.38,0.17,0.09,0.05,0.55000000000000004,0.14000000000000001]
["Latvia",0.04,0.41,0.16,0.04,0.12,0.22,0.2,0.33999999999999997]
["Lithuania",0.01,0.41,0.13,0.03,0.12,0.28999999999999998,0.16,0.41]
["Mongolia",0.06,0.44,0.28000000000000003,0.12,0.05,0.05,0.4,0.1]
["Montenegro",0.08,0.16,0.12,0.08,0.22,0.34,0.2,0.56000000000000005]
["Poland",0.06,0.33,0.14000000000000001,0.02,0.12,0.33,0.16,0.45]
["Romania",0.03,0.24,0.33,0.14000000000000001,0.13,0.13,0.47000000000000003,0.26]
["Russia",0.01,0.32,0.27,0.11,0.13,0.16,0.38,0.29000000000000004]
["Serbia",0.06,0.3,0.22,0.1,0.12,0.21,0.32,0.32999999999999996]
["Slovak Rep.",0,0.3,0.27,0.11,0.12,0.19,0.38,0.31]
["Slovenia",0.02,0.51,0.16,0.06,0.1,0.14000000000000001,0.22,0.24000000000000002]
["Tajikistan",0.37,0.24,0.08,0.01,0.1,0.2,0.09,0.30000000000000004]
["Turkey",0.14000000000000001,0.26,0.25,0.15,0.09,0.1,0.4,0.19]
[null,null,null,null,null,null,null,null,null,null,null,null,null,null,null,null,null,"Q2D WESTERN EUROPE DATABASE"]
[null,"D",null,null,null,null,null,null,null,null,null,null,null,null,null,null,null,"Local government representatives"]
["Country","None","Some of them","Most of them","All of them","Don't know","Haven't heard enough to say","Total involved","Don't know + Haven't heard"]
["Albania",0.01,0.38,0.27,0.15,0.08,0.1,{"$f":"SUM(D138+E138)","v":0.42000000000000004},{"$f":"SUM(F138+G138)","v":0.18}]
["Armenia",0.1,0.17,0.17,0.2,0.01,0.34,{"$f":"SUM(D139+E139)","v":0.37},{"$f":"SUM(F139+G139)","v":0.35000000000000003}]
["Azerbaijan",0.22,0.17,0.11,0.03,0.28000000000000003,0.19,0.14000000000000001,0.47000000000000003]
["Belarus",0.06,0.34,0.26,0.06,0.12,0.16,0.32,0.28000000000000003]
["Bosnia and Herz.",0.02,0.24,0.28000000000000003,0.23,0.06,0.17,0.51,0.23]
["Bulgaria",0.02,0.26,0.21,0.08,0.12,0.3,0.28999999999999998,0.42]
["Croatia",0.04,0.33,0.22,7.0000000000000007E-2,0.1,0.25,0.29000000000000004,0.35]
["Cyprus",0.03,0.48,0.18,0.06,0.1,0.14000000000000001,0.24,0.24000000000000002]
["Czech Rep.",0.1,0.44,0.12,0.02,0.09,0.23,0.13999999999999999,0.32]
["Estonia",0.1,0.39,0.05,0.01,0.16,0.28999999999999998,6.0000000000000005E-2,0.44999999999999996]
["Georgia",0.13,0.14000000000000001,0.04,0.03,0.41,0.26,7.0000000000000007E-2,0.66999999999999993]
["Germany",0.39,0.33,0.05,0.01,0.08,0.14000000000000001,6.0000000000000005E-2,0.22000000000000003]
["Greece",0.01,0.5,0.24,0.06,0.05,0.14000000000000001,0.3,0.19]
["Hungary",0.14000000000000001,0.33,0.1,0.06,0.09,0.28000000000000003,0.16,0.37]
["Italy",0.06,0.5,0.27,0.05,0.05,0.08,0.32,0.13]
["Kazakhstan",7.0000000000000007E-2,0.39,0.18,0.06,0.16,0.13,0.24,0.29000000000000004]
["Kosovo",0.01,0.3,0.28999999999999998,0.13,0.12,0.15,0.42,0.27]
["Kyrgyz Rep.",0.08,0.28000000000000003,0.34,0.17,0.09,0.05,0.51,0.14000000000000001]
["Latvia",0.09,0.4,0.11,0.03,0.12,0.26,0.14000000000000001,0.38]
["Lithuania",0.05,0.38,0.12,0.02,0.13,0.31,0.13999999999999999,0.44]
["Mongolia",0.15,0.43,0.21,0.09,0.06,7.0000000000000007E-2,0.3,0.13]
["Montenegro",0.08,0.19,0.1,0.08,0.21,0.34,0.18,0.55000000000000004]
["Poland",0.06,0.38,0.12,0.01,0.13,0.31,0.13,0.44]
["Romania",0.06,0.27,0.26,0.12,0.15,0.14000000000000001,0.38,0.29000000000000004]
["Russia",0.01,0.32,0.22,0.11,0.12,0.22,0.33,0.33999999999999997]
["Serbia",0.06,0.28000000000000003,0.22,0.11,0.13,0.2,0.33,0.33]
["Slovak Rep.",0.06,0.28999999999999998,0.18,0.08,0.17,0.22,0.26,0.39]
["Slovenia",0.05,0.48,0.14000000000000001,0.06,0.12,0.16,0.2,0.28000000000000003]
["Tajikistan",0.32,0.31,0.1,0.02,0.09,0.16,0.12000000000000001,0.25]
["Turkey",0.13,0.27,0.25,0.14000000000000001,0.1,0.12,0.39,0.22]
[null,null,null,null,null,null,null,null,null,null,null,null,null,null,null,null,null,"Q2E WESTERN EUROPE DATABASE"]
[null,"E",null,null,null,null,null,null,null,null,null,null,null,null,null,null,null,"Tax officials"]
["Country","None","Some of them","Most of them","All of them","Don't know","Haven't heard enough to say","Total involved","Don't know + Haven't heard"]
["Albania",0.02,0.34,0.26,0.17,0.09,0.11,{"$f":"SUM(D171+E171)","v":0.43000000000000005},{"$f":"SUM(F171+G171)","v":0.2}]
["Armenia",0.06,0.15,0.19,0.25,0.02,0.34,{"$f":"SUM(D172+E172)","v":0.44},{"$f":"SUM(F172+G172)","v":0.36000000000000004}]
["Azerbaijan",0.21,0.14000000000000001,0.14000000000000001,0.04,0.28999999999999998,0.19,0.18000000000000002,0.48]
["Belarus",0.06,0.35,0.25,0.06,0.13,0.17,0.31,0.30000000000000004]
["Bosnia and Herz.",0.02,0.23,0.28999999999999998,0.23,0.06,0.17,0.52,0.23]
["Bulgaria",0.02,0.26,0.22,0.1,0.14000000000000001,0.26,0.32,0.4]
["Croatia",0.05,0.35,0.18,7.0000000000000007E-2,0.1,0.26,0.25,0.36]
["Cyprus",0.02,0.47,0.19,0.06,0.08,0.18,0.25,0.26]
["Czech Rep.",0.08,0.44,0.11,0.03,0.1,0.24,0.14000000000000001,0.33999999999999997]
["Estonia",0.19,0.19,0.03,0,0.21,0.38,0.03,0.59]
["Georgia",0.11,0.15,0.04,0.02,0.42,0.26,0.06,0.67999999999999994]
["Germany",0.39,0.33,0.04,0.02,0.08,0.14000000000000001,0.06,0.22000000000000003]
["Greece",0,0.53,0.28999999999999998,0.08,0.03,0.06,0.37,0.09]
["Hungary",0.06,0.36,0.15,0.08,0.1,0.26,0.22999999999999998,0.36]
["Italy",7.0000000000000007E-2,0.51,0.22,0.05,0.06,0.08,0.27,0.14000000000000001]
["Kazakhstan",0.08,0.4,0.18,0.06,0.16,0.13,0.24,0.29000000000000004]
["Kosovo",0.03,0.32,0.25,0.1,0.13,0.18,0.35,0.31]
["Kyrgyz Rep.",0.09,0.24,0.35,0.19,0.09,0.04,0.54,0.13]
["Latvia",0.06,0.36,0.12,0.03,0.16,0.27,0.15,0.43000000000000005]
["Lithuania",0.03,0.35,0.12,0.02,0.15,0.33,0.13999999999999999,0.48]
["Mongolia",0.15,0.41,0.22,0.08,0.06,0.08,0.3,0.14000000000000001]
["Montenegro",7.0000000000000007E-2,0.2,0.1,0.08,0.21,0.34,0.18,0.55000000000000004]
["Poland",0.06,0.32,0.12,0.01,0.14000000000000001,0.35,0.13,0.49]
["Romania",0.05,0.31,0.23,0.1,0.16,0.15,0.33,0.31]
["Russia",0.02,0.36,0.18,0.08,0.15,0.2,0.26,0.35]
["Serbia",0.05,0.28999999999999998,0.24,0.1,0.13,0.19,0.33999999999999997,0.32]
["Slovak Rep.",0.03,0.32,0.21,0.08,0.16,0.21,0.28999999999999998,0.37]
["Slovenia",7.0000000000000007E-2,0.44,0.14000000000000001,0.05,0.12,0.17,0.19,0.29000000000000004]
["Tajikistan",0.28000000000000003,0.26,0.14000000000000001,0.03,0.11,0.17,0.17,0.28000000000000003]
["Turkey",0.14000000000000001,0.24,0.26,0.14000000000000001,0.11,0.11,0.4,0.22]
[null,null,null,null,null,null,null,null,null,null,null,null,null,null,null,null,null,"Q2F WESTERN EUROPE DATABASE"]
[null,"F",null,null,null,null,null,null,null,null,null,null,null,null,null,null,null,"Police"]
["Country","None","Some of them","Most of them","All of them","Don't know","Haven't heard enough to say","Total involved","Don't know + Haven't heard"]
["Albania",0.06,0.35,0.21,0.15,0.09,0.14000000000000001,{"$f":"SUM(D204+E204)","v":0.36},{"$f":"SUM(F204+G204)","v":0.23}]
["Armenia",7.0000000000000007E-2,0.17,0.19,0.22,0.02,0.33,{"$f":"SUM(D205+E205)","v":0.41000000000000003},{"$f":"SUM(F205+G205)","v":0.35000000000000003}]
["Azerbaijan",0.18,0.18,0.17,0.04,0.28000000000000003,0.15,0.21000000000000002,0.43000000000000005]
["Belarus",0.05,0.38,0.27,7.0000000000000007E-2,0.11,0.12,0.34,0.22999999999999998]
["Bosnia and Herz.",0.02,0.35,0.24,0.18,0.06,0.15,0.42,0.21]
["Bulgaria",0.02,0.34,0.24,7.0000000000000007E-2,0.12,0.21,0.31,0.32999999999999996]
["Croatia",0.06,0.43,0.13,0.05,0.08,0.25,0.18,0.33]
["Cyprus",0.02,0.56000000000000005,0.19,0.04,7.0000000000000007E-2,0.12,0.23,0.19]
["Czech Rep.",7.0000000000000007E-2,0.56999999999999995,0.08,0.02,7.0000000000000007E-2,0.2,0.1,0.27]
["Estonia",0.17,0.38,0.02,0.01,0.15,0.28000000000000003,0.03,0.43000000000000005]
["Georgia",0.17,0.15,0.04,0.01,0.39,0.25,0.05,0.64]
["Germany",0.39,0.36,0.03,0.01,7.0000000000000007E-2,0.14000000000000001,{"$f":"SUM(D215+E215)","v":0.04},{"$f":"SUM(F215+G215)","v":0.21000000000000002}]
["Greece",0.06,0.62,0.1,0.02,0.05,0.15,0.12000000000000001,0.2]
["Hungary",0.1,0.4,0.11,0.06,0.09,0.24,0.16999999999999998,0.32999999999999996]
["Italy",0.22,0.51,0.08,0.03,0.05,0.1,0.11,0.15000000000000002]
["Kazakhstan",0.05,0.41,0.25,0.1,0.12,0.08,0.35,0.2]
["Kosovo",0.09,0.44,0.14000000000000001,0.04,0.11,0.18,0.18000000000000002,0.28999999999999998]
["Kyrgyz Rep.",0.04,0.26,0.32,0.26,0.08,0.04,0.58000000000000007,0.12]
["Latvia",0.06,0.44,0.15,0.02,0.11,0.21,0.16999999999999998,0.32]
["Lithuania",0.04,0.48,0.12,0.02,0.11,0.24,0.13999999999999999,0.35]
["Mongolia",0.16,0.46,0.21,7.0000000000000007E-2,0.05,0.05,0.28000000000000003,0.1]
["Montenegro",7.0000000000000007E-2,0.21,0.12,7.0000000000000007E-2,0.21,0.32,0.19,0.53]
["Poland",0.06,0.46,0.09,0.02,0.12,0.25,0.11,0.37]
["Romania",7.0000000000000007E-2,0.35,0.21,0.08,0.14000000000000001,0.14000000000000001,0.28999999999999998,0.28000000000000003]
["Russia",0.01,0.39,0.23,0.09,0.12,0.16,0.32,0.28000000000000003]
["Serbia",0.05,0.34,0.22,0.11,0.11,0.17,0.33,0.28000000000000003]
["Slovak Rep.",0.01,0.38,0.19,0.09,0.13,0.19,0.28000000000000003,0.32]
["Slovenia",0.15,0.47,0.06,0.03,0.13,0.16,0.09,0.29000000000000004]
["Tajikistan",0.24,0.36,0.14000000000000001,0.04,0.09,0.14000000000000001,0.18000000000000002,0.23]
["Turkey",0.14000000000000001,0.32,0.2,0.12,0.12,0.09,0.32,0.21]
[null,null,null,null,null,null,null,null,null,null,null,null,null,null,null,null,null,"Q2G WESTERN EUROPE DATABASE"]
[null,"G",null,null,null,null,null,null,null,null,null,null,null,null,null,null,null,"Judges and magistrates"]
["Country","None","Some of them","Most of them","All of them","Don't know","Haven't heard enough to say","Total involved","Don't know + Haven't heard"]
["Albania",0.02,0.24,0.28999999999999998,0.26,0.08,0.11,{"$f":"SUM(D237+E237)","v":0.55000000000000004},{"$f":"SUM(F237+G237)","v":0.19}]
["Armenia",0.06,0.17,0.2,0.21,0.02,0.34,{"$f":"SUM(D238+E238)","v":0.41000000000000003},{"$f":"SUM(F238+G238)","v":0.36000000000000004}]
["Azerbaijan",0.2,0.17,0.12,0.04,0.28999999999999998,0.19,0.16,0.48]
["Belarus",0.1,0.32,0.18,0.05,0.16,0.18,0.22999999999999998,0.33999999999999997]
["Bosnia and Herz.",0.02,0.31,0.25,0.18,0.06,0.17,0.43,0.23]
["Bulgaria",0.02,0.22,0.28999999999999998,0.14000000000000001,0.12,0.21,0.43,0.32999999999999996]
["Croatia",0.06,0.36,0.19,7.0000000000000007E-2,0.08,0.24,0.26,0.32]
["Cyprus",0.04,0.49,0.14000000000000001,0.05,0.09,0.19,0.19,0.28000000000000003]
["Czech Rep.",0.06,0.52,0.1,0.03,7.0000000000000007E-2,0.21,0.13,0.28000000000000003]
["Estonia",0.2,0.26,0.03,0.01,0.19,0.32,{"$f":"SUM(D246+E246)","v":0.04},{"$f":"SUM(F246+G246)","v":0.51}]
["Georgia",0.13,0.16,0.05,0.02,0.4,0.25,7.0000000000000007E-2,0.65]
["Germany",0.33,0.4,0.04,0.01,0.08,0.15,0.05,0.22999999999999998]
["Greece",0.06,0.56999999999999995,0.15,0.02,0.05,0.15,0.16999999999999998,0.2]
["Hungary",0.11,0.33,0.14000000000000001,0.05,0.1,0.27,0.19,0.37]
["Italy",0.16,0.53,0.15,0.03,0.05,0.08,0.18,0.13]
["Kazakhstan",7.0000000000000007E-2,0.37,0.19,0.08,0.16,0.12,0.27,0.28000000000000003]
["Kosovo",0.04,0.3,0.23,0.17,0.11,0.14000000000000001,0.4,0.25]
["Kyrgyz Rep.",0.04,0.21,0.34,0.28000000000000003,0.09,0.04,0.62000000000000011,0.13]
["Latvia",0.06,0.41,0.1,0.03,0.14000000000000001,0.26,0.13,0.4]
["Lithuania",0.03,0.39,0.17,0.04,0.11,0.26,0.21000000000000002,0.37]
["Mongolia",0.16,0.43,0.19,0.08,0.06,7.0000000000000007E-2,0.27,0.13]
["Montenegro",7.0000000000000007E-2,0.22,0.11,0.06,0.2,0.33,0.16999999999999998,0.53]
["Poland",7.0000000000000007E-2,0.33,0.12,0.01,0.13,0.33,0.13,0.46]
["Romania",0.06,0.34,0.23,0.09,0.15,0.13,0.32,0.28000000000000003]
["Russia",0.03,0.36,0.17,7.0000000000000007E-2,0.16,0.21,0.24000000000000002,0.37]
["Serbia",0.06,0.32,0.21,0.11,0.12,0.19,0.32,0.31]
["Slovak Rep.",0.01,0.28999999999999998,0.25,0.14000000000000001,0.11,0.19,0.39,0.3]
["Slovenia",0.06,0.5,0.13,0.06,0.11,0.14000000000000001,0.19,0.25]
["Tajikistan",0.28000000000000003,0.27,0.1,0.04,0.11,0.2,0.14000000000000001,0.31]
["Turkey",0.15,0.28000000000000003,0.22,0.14000000000000001,0.11,0.1,0.36,0.21000000000000002]
[]
[null,"H",null,null,null,null,null,null,null,null,null,null,null,null,null,null,null,"Business executives"]
["Country","None","Some of them","Most of them","All of them","Don't know","Haven't heard enough to say","Total involved","Don't know + Haven't heard"]
["Albania",0.05,0.28000000000000003,0.23,0.14000000000000001,0.12,0.17,{"$f":"SUM(D270+E270)","v":0.37},{"$f":"SUM(F270+G270)","v":0.29000000000000004}]
["Armenia",0.08,0.23,0.16,0.15,0.03,0.35,0.31,0.38]
["Azerbaijan",0.23,0.13,7.0000000000000007E-2,0.03,0.32,0.22,0.1,0.54]
["Belarus",7.0000000000000007E-2,0.37,0.23,0.09,0.12,0.13,0.32,0.25]
["Bosnia and Herz.",0.02,0.25,0.27,0.21,0.06,0.18,0.48,0.24]
["Bulgaria",0.03,0.24,0.14000000000000001,7.0000000000000007E-2,0.2,0.33,0.21000000000000002,0.53]
["Croatia",0.05,0.36,0.18,7.0000000000000007E-2,0.09,0.26,0.25,0.35]
["Cyprus",0.01,0.51,0.19,0.04,0.09,0.15,0.23,0.24]
["Czech Rep.",0.03,0.45,0.15,0.04,0.1,0.23,0.19,0.33]
["Estonia",0.06,0.5,0.06,0.01,0.14000000000000001,0.23,6.9999999999999993E-2,0.37]
["Georgia",0.12,0.15,0.05,0.02,0.41,0.25,7.0000000000000007E-2,0.65999999999999992]
["Germany",0.08,0.43,0.27,0.06,0.06,0.11,{"$f":"SUM(D281+E281)","v":0.33},{"$f":"SUM(F281+G281)","v":0.16999999999999998}]
["Greece",0.04,0.45,0.21,0.04,0.08,0.17,0.25,0.25]
["Hungary",0.05,0.32,0.18,0.09,0.1,0.26,0.27,0.36]
["Italy",0.11,0.55000000000000004,0.18,0.04,0.05,7.0000000000000007E-2,0.22,0.12000000000000001]
["Kazakhstan",7.0000000000000007E-2,0.42,0.21,7.0000000000000007E-2,0.13,0.09,0.28000000000000003,0.22]
["Kosovo",0.05,0.34,0.2,0.1,0.12,0.18,0.30000000000000004,0.3]
["Kyrgyz Rep.",0.05,0.31,0.32,0.2,0.08,0.05,0.52,0.13]
["Latvia",0.06,0.42,0.1,0.02,0.16,0.25,0.12000000000000001,0.41000000000000003]
["Lithuania",0.03,0.39,0.15,0.02,0.14000000000000001,0.27,0.16999999999999998,0.41000000000000003]
["Mongolia",0.19,0.44,0.18,0.06,0.06,0.06,0.24,0.12]
["Montenegro",0.08,0.19,0.11,0.09,0.2,0.33,0.2,0.53]
["Poland",0.06,0.36,0.12,0.02,0.14000000000000001,0.31,0.13999999999999999,0.45]
["Romania",0.04,0.3,0.21,0.09,0.21,0.15,0.3,0.36]
["Russia",0.02,0.37,0.18,0.09,0.15,0.2,0.27,0.35]
["Serbia",0.04,0.28999999999999998,0.23,0.11,0.13,0.19,0.34,0.32]
["Slovak Rep.",0.02,0.32,0.2,0.08,0.17,0.21,0.28000000000000003,0.38]
["Slovenia",0.03,0.54,0.14000000000000001,0.04,0.11,0.14000000000000001,0.18000000000000002,0.25]
["Tajikistan",0.24,0.28000000000000003,0.11,0.02,0.13,0.22,0.13,0.35]
["Turkey",0.12,0.28000000000000003,0.21,0.14000000000000001,0.13,0.12,0.35,0.25]
[null,null,null,null,null,null,null,null,null,null,null,null,null,null,null,null,null,"Q2IWESTERN EUROPE DATABASE"]
[null,"I",null,null,null,null,null,null,null,null,null,null,null,null,null,null,null,"Religious leaders"]
["Country","None","Some of them","Most of them","All of them","Don't know","Haven't heard enough to say","Total involved","Don't know + Haven't heard"]
["Albania",0.17,0.19,0.16,0.11,0.17,0.2,{"$f":"SUM(D303+E303)","v":0.27},{"$f":"SUM(F303+G303)","v":0.37}]
["Armenia",0.14000000000000001,0.16,0.15,0.14000000000000001,0.05,0.36,{"$f":"SUM(D304+E304)","v":0.29000000000000004},{"$f":"SUM(F304+G304)","v":0.41}]
["Azerbaijan",0.23,0.11,0.06,0.03,0.34,0.24,{"$f":"SUM(D305+E305)","v":0.09},{"$f":"SUM(F305+G305)","v":0.58000000000000007}]
["Belarus",0.22,0.21,0.12,0.06,0.2,0.19,0.18,0.39]
["Bosnia and Herz.",0.09,0.31,0.18,0.14000000000000001,0.08,0.21,0.32,0.28999999999999998]
["Bulgaria",0.05,0.19,0.11,0.06,0.21,0.37,0.16999999999999998,0.57999999999999996]
["Croatia",0.12,0.27,0.08,0.05,0.14000000000000001,0.34,0.13,0.48000000000000004]
["Cyprus",0.08,0.44,0.11,0.05,0.1,0.23,0.16,0.33]
["Czech Rep.",0.13,0.32,0.08,0.03,0.16,0.28000000000000003,0.11,0.44000000000000006]
["Estonia",0.18,0.17,0.01,0.01,0.28000000000000003,0.36,0.02,0.64]
["Georgia",0.2,0.12,0.02,0.01,0.4,0.24,0.03,0.64]
["Germany",0.22,0.44,0.06,0.03,0.09,0.16,0.09,0.25]
["Greece",0.06,0.43,0.13,0.04,0.08,0.25,0.17,0.33]
["Hungary",0.13,0.27,0.11,7.0000000000000007E-2,0.12,0.3,0.18,0.42]
["Italy",0.19,0.49,0.11,0.05,0.06,0.09,0.16,0.15]
["Kazakhstan",0.19,0.19,0.08,0.04,0.31,0.18,0.12,0.49]
["Kosovo",0.15,0.3,0.1,0.06,0.13,0.25,0.16,0.38]
["Kyrgyz Rep.",0.31,0.22,0.14000000000000001,0.11,0.16,0.06,0.25,0.22]
["Latvia",0.18,0.23,0.05,0.02,0.21,0.31,7.0000000000000007E-2,0.52]
["Lithuania",0.13,0.27,0.06,0.02,0.18,0.34,0.08,0.52]
["Mongolia",0.5,0.24,0.08,0.03,0.08,7.0000000000000007E-2,0.11,0.15000000000000002]
["Montenegro",0.14000000000000001,0.14000000000000001,0.06,0.06,0.24,0.37,0.12,0.61]
["Poland",0.12,0.24,0.06,0.01,0.19,0.38,6.9999999999999993E-2,0.57000000000000006]
["Romania",0.1,0.28000000000000003,0.2,0.09,0.18,0.15,0.29000000000000004,0.32999999999999996]
["Russia",0.08,0.16,0.06,0.06,0.28000000000000003,0.34,0.12,0.62000000000000011]
["Serbia",0.14000000000000001,0.26,0.13,7.0000000000000007E-2,0.16,0.24,0.2,0.4]
["Slovak Rep.",0.06,0.28999999999999998,0.14000000000000001,0.1,0.19,0.22,0.24000000000000002,0.41000000000000003]
["Slovenia",0.09,0.44,0.09,0.06,0.16,0.15,0.15,0.31]
["Tajikistan",0.31,0.3,0.06,0.01,0.11,0.2,6.9999999999999993E-2,0.31]
["Turkey",0.17,0.25,0.17,0.16,0.13,0.12,0.33,0.25]
[null,null,null,null,null,null,null,null,null,null,null,null,null,null,null,null,null,"Q3 WESTERN EUROPE DATABASE"]
["QUESTION 2",null,null,null,null,null,null,null,null,null,null,null,null,null,null,null,null,"There is less corruption now than around 4 years ago"]
["Country","Strongly disagree","Disagree","Neither disagree nor agree","Agree","Strongly agree","Don't know/ Not applicable",null,"Total Disagree","Neither","Total Agree"]
["Albania",0.04,0.23,0.35,0.31,0.02,0.05,null,{"$f":"SUM(B336+C336)","v":0.27},{"$f":"D336","v":0.35},{"$f":"F336+E336","v":0.33}]
["Armenia",0.48,0.2,0.13,0.1,0.04,0.05,null,{"$f":"SUM(B337+C337)","v":0.67999999999999994},{"$f":"D337","v":0.13},{"$f":"F337+E337","v":0.14000000000000001}]
["Azerbaijan",0.04,0.14000000000000001,0.14000000000000001,0.42,0.03,0.23,null,0.18000000000000002,0.14000000000000001,0.44999999999999996]
["Belarus",0.11,0.25,0.28999999999999998,0.12,0.03,0.2,null,0.36,0.28999999999999998,0.15]
["Bosnia and Herz.",0.3,0.35,0.23,7.0000000000000007E-2,0.02,0.04,null,0.64999999999999991,0.23,9.0000000000000011E-2]
["Bulgaria",0.33,0.28999999999999998,0.2,0.06,0.02,9.9999999999999992E-2,null,0.62,0.2,0.08]
["Croatia",0.23,0.27,0.25,0.15,0.04,0.05,null,0.5,0.25,0.19]
["Cyprus",0.28000000000000003,0.37,0.19,0.12,0.01,0.02,null,0.65,0.19,0.13]
["Czech Rep.",0.2,0.34,0.26,0.14000000000000001,0.02,0.06,null,0.54,0.26,0.16]
["Estonia",0.12,0.34,0.19,0.15,0.02,0.18000000000000002,null,0.46,0.19,0.16999999999999998]
["Georgia",0.08,0.36,0.13,0.22,0.01,0.19,null,0.44,0.13,0.23]
["Germany",0.03,0.19,0.4,0.09,0.03,0.26,null,0.22,{"$f":"D347","v":0.4},{"$f":"F347+E347","v":0.12}]
["Greece",0.24,0.38,0.24,0.11,0.01,0.02,null,0.62,0.24,0.12]
["Hungary",0.35,0.22,0.17,0.09,0.05,0.13,null,0.56999999999999995,0.17,0.14000000000000001]
["Italy",0.32,0.31,0.24,0.09,0.01,0.03,null,0.63,0.24,9.9999999999999992E-2]
["Kazakhstan",0.1,0.22,0.22,0.3,7.0000000000000007E-2,9.9999999999999992E-2,null,0.32,0.22,0.37]
["Kosovo",0.24,0.38,0.21,0.1,0.01,0.05,null,0.62,0.21,0.11]
["Kyrgyz Rep.",0.2,0.26,0.17,0.25,7.0000000000000007E-2,0.04,null,0.46,0.17,0.32]
["Latvia",0.15,0.44,0.17,0.11,0.01,0.12,null,0.59,0.17,0.12]
["Lithuania",0.14000000000000001,0.4,0.22,0.15,0.02,0.06,null,0.54,0.22,0.16999999999999998]
["Mongolia",0.28999999999999998,0.39,0.12,0.14000000000000001,0.02,0.03,null,0.67999999999999994,0.12,0.16]
["Montenegro",0.14000000000000001,0.32,0.24,0.14000000000000001,0.04,0.13,null,0.46,0.24,0.18000000000000002]
["Poland",0.02,0.28999999999999998,0.3,0.22,0.04,0.14000000000000001,null,0.31,0.3,0.26]
["Romania",0.26,0.3,0.18,0.13,0.05,0.09,null,0.56000000000000005,0.18,0.18]
["Russia",0.23,0.38,0.19,0.09,0.03,0.08,null,0.61,0.19,0.12]
["Serbia",0.15,0.25,0.24,0.21,0.05,0.09,null,0.4,0.24,0.26]
["Slovak Rep.",0.26,0.36,0.25,7.0000000000000007E-2,0.02,0.05,null,0.62,0.25,9.0000000000000011E-2]
["Slovenia",0.35,0.39,0.1,0.05,0.02,0.09,null,0.74,0.1,7.0000000000000007E-2]
["Tajikistan",0.03,0.09,0.25,0.35,0.13,0.15,null,0.12,0.25,0.48]
["Turkey",0.22,0.23,0.24,0.21,0.08,0.03,null,0.45,0.24,0.28999999999999998]
[null,null,null,null,null,null,null,null,null,null,null,null,null,null,null,null,null,"Q4 WESTERN EUROPE DATABASE"]
["QUESTION 3",null,null,null,null,null,null,null,null,null,null,null,null,null,null,null,null,"Why people don't report corruption"]
["Country","People don’t have enough time to report it","People don’t know where to report it","People don’t know how to report it","Nothing will be done / It wouldn’t make a difference","It’s too expensive to report (e.g. due to travel or phone charges)","Corruption is normal / Everyone does it / everyone is involved","People are afraid of the consequences","The officials where they would report to are also corrupt / officials are involved in the corruption","It’s government’s money, not the people’s, so it’s not our problem","Corruption is hidden/ it’s difficult to prove","Because they would implicate themselves as bribe-givers","Most people do report incidents of corruption","Other","Don’t know","Refusal"]
["Albania",0.05,0.08,0.08,0.15,0,0.03,0.13,0.11,0.01,0.12,0.1,0.06,0,0.06,0.03]
["Armenia",0,0.02,0.02,0.23,0,0.04,0.41,0.05,0,0.03,0.05,0,0.02,0.13,0]
["Azerbaijan",0.03,0.02,0.02,0.03,0,0,0.14000000000000001,0.01,0,0.12,0.14000000000000001,0.04,0.02,0.42,0.01]
["Belarus",0.05,0.06,0.04,0.15,0.03,0.03,0.2,0.08,0.02,0.09,0.14000000000000001,0.04,0.01,0.04,0.01]
["Bosnia and Herz.",0.02,0.04,0.05,0.2,0.01,0.01,0.33,0.05,0,0.17,0.04,0.01,0.01,0.06,0.02]
["Bulgaria",0.01,0.03,0.04,0.17,0,0.02,0.28999999999999998,0.04,0,0.22,0.06,0.02,0,0.08,0.01]
["Croatia",0.03,0.04,0.05,0.15,0,0.02,0.28999999999999998,0.04,0.01,0.24,0.05,0.01,0,0.05,0.02]
["Cyprus",0.01,0.02,0.01,0.16,0,0.03,0.4,0.02,0,0.19,0.08,0.05,0,0.03,0]
["Czech Rep.",0.02,0.05,0.05,0.14000000000000001,0,0.01,0.28999999999999998,0.02,0.01,0.27,7.0000000000000007E-2,0.02,0.01,0.03,0.01]
["Estonia",0.03,0.02,0.03,0.11,0,0.01,0.28999999999999998,0.01,0.02,0.15,0.12,0.02,0.03,0.15,0]
["Georgia",0.02,0.04,0.01,7.0000000000000007E-2,0,0.01,0.28999999999999998,0.02,0.01,0.14000000000000001,0.05,0.04,0.01,0.28000000000000003,0.02]
["Germany",0.01,0.08,7.0000000000000007E-2,7.0000000000000007E-2,0.01,0,0.19,0.01,0,0.24,0.05,0.12,0.01,0.14000000000000001,0]
["Greece",0.02,0.06,7.0000000000000007E-2,0.18,0.01,0.05,0.27,0.03,0,0.19,0.08,0.02,0,0.02,0]
["Hungary",0.03,0.05,0.05,0.2,0.01,0.02,0.23,0.02,0.01,0.24,0.02,0.01,0,0.08,0.03]
["Italy",0.03,7.0000000000000007E-2,0,0.16,0,0.03,0.28000000000000003,0.05,0.01,0.2,0.04,0.08,0.01,0.03,0.01]
["Kazakhstan",0.04,0.03,0.03,0.13,0.01,0.02,0.26,0.03,0.01,0.14000000000000001,0.14000000000000001,7.0000000000000007E-2,0,0.06,0.02]
["Kosovo",0.01,0.08,0.05,0.11,0,0,0.31,7.0000000000000007E-2,0,0.09,0.05,0.03,0,0.16,0.05]
["Kyrgyz Rep.",0.05,7.0000000000000007E-2,0.05,0.11,0.03,0.08,0.1,0.12,0,0.14000000000000001,0.12,7.0000000000000007E-2,0.01,0.04,0.01]
["Latvia",0.02,0.02,0.01,0.14000000000000001,0,0.04,0.34,0.04,0.01,0.12,0.09,0.01,0.05,0.1,0.01]
["Lithuania",0.02,0.03,0.02,0.14000000000000001,0,0.03,0.39,0.01,0.01,0.21,7.0000000000000007E-2,0.01,0.01,0.05,0]
["Mongolia",0.03,0.08,0.06,0.09,0.01,0.05,0.22,7.0000000000000007E-2,0.03,0.2,0.11,0.02,0,0.04,0]
["Montenegro",0.01,0.03,0.03,0.1,0,0.01,0.33,0.02,0.01,0.19,0.05,0.02,0,0.15,0.05]
["Poland",0.06,7.0000000000000007E-2,7.0000000000000007E-2,0.08,0,0.02,0.26,0.02,0,0.14000000000000001,0.09,0.02,0,0.17,0.01]
["Romania",0.05,0.08,0.05,0.14000000000000001,0.02,0.01,0.36,0.03,0,0.1,0.03,0.01,0,0.11,0.01]
["Russia",0.08,0.06,0.08,0.16,0.01,0.02,0.17,0.09,0.01,0.14000000000000001,0.11,0.01,0,0.05,0.01]
["Serbia",0.06,0.09,0.09,0.1,0.01,0.02,0.24,0.02,0,0.17,0.06,0.04,0,0.08,0.01]
["Slovak Rep.",0.02,0.05,7.0000000000000007E-2,0.22,0.01,0.02,0.27,0.02,0,0.19,7.0000000000000007E-2,0.02,0,0.06,0.01]
["Slovenia",0.01,0.02,0.02,0.11,0,0.04,0.36,0.02,0,0.15,0.14000000000000001,0.01,0.02,0.1,0.02]
["Tajikistan",0.05,7.0000000000000007E-2,0.06,0.05,0.01,0.03,0.18,0.05,0.01,0.2,7.0000000000000007E-2,0.09,0,0.11,0.02]
["Turkey",0.05,0.08,0.05,7.0000000000000007E-2,0,0.02,0.19,0.09,0.01,0.14000000000000001,0.08,0.03,0,0.14000000000000001,0.04]
[]
["QUESTION 5",null,null,null,null,null,null,null,null,null,null,null,null,null,null,null,null,"How good government handles corruption"]
["Country","Very Badly","Fairly Badly","Total badly","Fairly Well","Very Well","Total well","Don’t know"," Haven’t heard enough"," Don't know + Haven’t heard enough ","Refusal"]
["Albania",0.05,0.32,{"$f":"SUM(C402+B402)","v":0.37},0.33,7.0000000000000007E-2,{"$f":"SUM(F402+E402)","v":0.4},0.04,0.17,{"$f":"SUM(I402+H402)","v":0.21000000000000002},0.02]
["Armenia",0.43,0.22,{"$f":"SUM(C403+B403)","v":0.65},0.12,0.02,{"$f":"SUM(F403+E403)","v":0.13999999999999999},0.06,0.15,{"$f":"SUM(I403+H403)","v":0.21},0]
["Azerbaijan",0.06,0.09,0.15,0.2,0.04,0.24000000000000002,0.25,0.35,0.6,0.01]
["Belarus",0.1,0.35,0.44999999999999996,0.25,0.03,0.28000000000000003,0.11,0.14000000000000001,0.25,0.03]
["Bosnia and Herz.",0.39,0.43,0.82000000000000006,0.04,0,0.04,0.02,0.1,0.12000000000000001,0.01]
["Bulgaria",0.28000000000000003,0.26,0.54,0.11,0,0.11,0.08,0.26,0.34,0.01]
["Croatia",0.16,0.41,0.56999999999999995,0.16,0,0.16,0.06,0.19,0.25,0.01]
["Cyprus",0.16,0.3,0.45999999999999996,0.27,0.02,{"$f":"SUM(F409+E409)","v":0.29000000000000004},0.14000000000000001,0.1,0.24000000000000002,0.01]
["Czech Rep.",0.17,0.5,0.67,0.16,0,{"$f":"SUM(F410+E410)","v":0.16},0.04,0.13,0.17,0]
["Estonia",0.09,0.28999999999999998,0.38,0.25,0,0.25,0.1,0.27,0.37,0]
["Georgia",0.17,0.24,0.41000000000000003,0.23,0.03,0.26,0.22,0.1,0.32,0.01]
["Germany",0.04,0.21,0.25,0.27,0.04,0.31,0.1,0.35,0.44999999999999996,0]
["Greece",0.22,0.37,0.59,0.14000000000000001,0.01,0.15000000000000002,0.08,0.17,0.25,0]
["Hungary",0.24,0.32,0.56000000000000005,0.21,0.02,0.22999999999999998,0.05,0.17,0.22000000000000003,0.01]
["Italy",0.25,0.45,0.7,0.15,0.01,0.16,0.05,0.08,0.13,0.01]
["Kazakhstan",0.15,0.31,0.45999999999999996,0.32,0.05,0.37,7.0000000000000007E-2,0.08,0.15000000000000002,0.01]
["Kosovo",0.28000000000000003,0.39,0.67,7.0000000000000007E-2,0,7.0000000000000007E-2,0.08,0.17,0.25,0]
["Kyrgyz Rep.",0.25,0.32,0.57000000000000006,0.26,0.05,0.31,7.0000000000000007E-2,0.03,0.1,0.01]
["Latvia",0.24,0.47,0.71,0.06,0,0.06,0.04,0.18,0.22,0.01]
["Lithuania",0.2,0.51,0.71,0.13,0,0.13,0.05,0.1,0.15000000000000002,0]
["Mongolia",0.15,0.47,0.62,0.34,0.01,0.35000000000000003,0.02,0.01,0.03,0]
["Montenegro",0.17,0.33,0.5,0.15,0.02,0.16999999999999998,0.12,0.19,0.31,0.03]
["Poland",0.03,0.23,0.26,0.22,0.03,0.25,0.1,0.37,0.47,0]
["Romania",0.12,0.31,0.43,0.26,0.01,0.27,0.11,0.19,0.3,0]
["Russia",0.15,0.47,0.62,0.17,0.01,0.18000000000000002,0.08,0.12,0.2,0]
["Serbia",0.11,0.33,0.44,0.26,0.02,0.28000000000000003,0.1,0.15,0.25,0.03]
["Slovak Rep.",0.25,0.31,0.56000000000000005,0.13,0.01,0.14000000000000001,0.09,0.19,0.28000000000000003,0.01]
["Slovenia",0.32,0.45,0.77,0.08,0,0.08,0.04,0.1,0.14000000000000001,0]
["Tajikistan",0.04,0.16,0.2,0.5,0.1,0.6,0.14000000000000001,0.05,0.19,0.01]
["Turkey",0.21,0.2,0.41000000000000003,0.31,0.1,0.41000000000000003,0.06,0.08,0.14000000000000001,0.03]
[null,null,null,null,null,null,null,null,null,null,null,null,null,null,null,null,null,"Q7 WESTERN EUROPE DATABASE"]
["QUESTION 7",null,null,null,null,null,null,null,null,null,null,null,null,null,null,null,null,"What can ordinary people do"]
["Country","Refuse to pay bribes","Report corruption when you see or experience it","Vote for clean candidates or parties or for parties that promise to fight corruption","Speak out about the problem, for example, by calling a radio program or writing a letter, or on social media","Talk to friends and relatives about the problem","Sign a petition asking for a stronger fight against corruption","Join or support an organization that is fighting corruption","Participate in protest marches or demonstrations against corruption","Boycott a business which has been found guilty of engaging in corruption","Nothing / Ordinary people cannot do anything","Other","Don’t know","Not applicable","Refusal"]
["Albania",0.3,0.19,0.05,0.06,0.03,0.04,7.0000000000000007E-2,0.02,0.01,0.19,0,0.04,0,0.02]
["Armenia",0.21,0.03,0,0.01,0.01,0,0.01,0.02,0,0.52,0.03,0.14000000000000001,0,0]
["Azerbaijan",0.17,7.0000000000000007E-2,0.04,0.03,0.02,0.01,0.01,0.01,0,0.23,0.02,0.38,0.01,0.01]
["Belarus",0.25,0.06,0.08,0.03,0.02,0.01,0.01,0,0.01,0.5,0,0.02,0,0.01]
["Bosnia and Herz.",0.23,0.1,0.04,0.06,0.02,0.03,0.01,0.02,0.03,0.35,0.01,0.08,0,0.02]
["Bulgaria",0.25,0.1,0.03,0.05,0.02,0.01,0.02,0.02,0.01,0.37,0,0.09,0.01,0.01]
["Croatia",0.25,0.17,0.05,0.04,0.02,0.03,0.02,0.01,0.01,0.32,0,0.06,0,0.02]
["Cyprus",0.13,0.27,0.06,0.08,7.0000000000000007E-2,0.01,0.02,0.03,0.02,0.26,0,0.04,0,0]
["Czech Rep.",0.34,0.11,0.06,0.02,0.03,0.01,0.01,0,0.02,0.32,0,7.0000000000000007E-2,0,0.01]
["Estonia",0.3,0.15,0.04,0.05,0.02,0,0.01,0,0.01,0.26,0.02,0.13,0,0]
["Georgia",0.16,0.11,0.06,0.03,0,0.02,0.02,0,0.01,0.3,0.02,0.24,0,0.02]
["Germany",0.1,0.41,7.0000000000000007E-2,0.05,0.04,0.01,0.02,0.02,0.04,0.1,0,0.13,0,0]
["Greece",0.32,0.32,0.05,0.06,0.03,0.01,0.02,0.01,0.01,0.15,0,0.02,0,0]
["Hungary",0.1,7.0000000000000007E-2,0.05,0.06,7.0000000000000007E-2,0.02,0.01,0.01,0.02,0.46,0,0.09,0.01,0.03]
["Italy",0.21,0.23,7.0000000000000007E-2,0.04,0.02,0.02,0.08,0.02,0.03,0.23,0.01,0.04,0,0]
["Kazakhstan",0.24,0.08,0.05,0.06,0.01,0,0.02,0,0.01,0.43,0,7.0000000000000007E-2,0,0.02]
["Kosovo",0.18,0.17,0.05,0.05,0.02,0.04,0.06,0.04,0.01,0.19,0,0.14000000000000001,0.01,0.04]
["Kyrgyz Rep.",0.2,0.1,0.1,0.05,0.02,0.01,0.02,0.01,0.03,0.42,0,0.02,0,0.01]
["Latvia",0.28999999999999998,0.17,0.02,0.03,0.01,0.01,0.02,0.01,0,0.28000000000000003,0.05,0.09,0.01,0.02]
["Lithuania",0.34,0.15,0.03,0.02,0.01,0.01,0.01,0.01,0.01,0.31,0.02,7.0000000000000007E-2,0,0]
["Mongolia",0.49,0.14000000000000001,0.02,0.02,0.01,0.01,0.02,0.01,0.01,0.24,0,0.03,0,0]
["Montenegro",0.18,0.2,0.03,0.04,0.04,0.03,0.04,0.01,0.01,0.25,0,0.11,0.01,0.05]
["Poland",0.33,0.11,0.08,0.06,0.02,0.01,0.01,0.01,0.04,0.18,0,0.15,0,0.01]
["Romania",0.27,0.12,0.05,0.03,0.04,0.02,0.02,0.05,0,0.24,0,0.14000000000000001,0,0.01]
["Russia",0.25,0.09,0.05,0.06,0.02,0.02,0.03,0.01,0.04,0.33,0,0.08,0.01,0.01]
["Serbia",0.16,0.15,0.08,0.06,0.06,0.03,0.02,0,0.01,0.28999999999999998,0,0.11,0.01,0.02]
["Slovak Rep.",0.28000000000000003,7.0000000000000007E-2,0.02,0.02,0.05,0.02,0.01,0.01,0.02,0.41,0,0.08,0,0.01]
["Slovenia",0.15,0.2,0.01,0.02,0.01,0.01,0.02,0.01,0.01,0.36,0.03,0.13,0,0.01]
["Tajikistan",0.31,0.1,7.0000000000000007E-2,0.04,0.03,0.01,0.04,0,0,0.27,0,0.1,0.01,0.02]
["Turkey",0.18,0.15,0.15,0.05,0.03,0.04,0.06,0.06,0.04,7.0000000000000007E-2,0,0.13,0.02,0.04]
[]
[null,null,null,null,null,null,null,null,null,null,null,null,null,null,null,null,null,"Q8 WESTERN EUROPE DATABASE"]
["QUESTION 6","A",null,null,null,null,null,null,null,null,null,null,null,null,null,null,null,"Ordinary people can make difference"]
["Country","Strongly agree","Agree","Neither","Disagree","Strongly disagree","Don’t know",null,"Total agree","Total disagree","Refusal"]
["Albania",0.16,0.42,0.17,0.16,0.06,0.01,null,{"$f":"B469+C469","v":0.57999999999999996},{"$f":"F469+E469","v":0.22},0.02]
["Armenia",0.12,0.17,0.06,0.15,0.49,0.01,null,{"$f":"B470+C470","v":0.29000000000000004},{"$f":"F470+E470","v":0.64},0]
["Azerbaijan",0.03,0.3,0.18,0.16,7.0000000000000007E-2,0.24,null,0.32999999999999996,0.23,0.01]
["Belarus",0.02,0.08,0.23,0.34,0.19,0.1,null,0.1,0.53,0.03]
["Bosnia and Herz.",0.1,0.26,0.22,0.19,0.17,0.05,null,0.36,0.36,0.01]
["Bulgaria",7.0000000000000007E-2,0.19,0.18,0.18,0.3,0.06,null,0.26,0.48,0.02]
["Croatia",7.0000000000000007E-2,0.22,0.22,0.22,0.16,0.09,null,0.29000000000000004,0.38,0.02]
["Cyprus",0.12,0.42,0.18,0.18,7.0000000000000007E-2,0.02,null,0.54,0.25,0]
["Czech Rep.",0.01,0.12,0.2,0.36,0.28000000000000003,0.02,null,0.13,0.64,0.01]
["Estonia",0.1,0.42,0.15,0.18,7.0000000000000007E-2,7.0000000000000007E-2,null,0.52,0.25,0.01]
["Georgia",0.06,0.39,0.12,0.21,0.08,0.13,null,{"$f":"B479+C479","v":0.45},{"$f":"F479+E479","v":0.28999999999999998},0.01]
["Germany",0.13,0.35,0.33,0.1,0.03,0.06,null,0.48,0.13,0]
["Greece",0.13,0.42,0.23,0.17,0.04,0.01,null,0.55000000000000004,0.21000000000000002,0]
["Hungary",0.05,0.09,0.15,0.17,0.46,0.03,null,0.14000000000000001,0.63,0.04]
["Italy",0.15,0.36,0.18,0.16,0.11,0.02,null,0.51,0.27,0.01]
["Kazakhstan",0.05,0.23,0.25,0.23,0.11,0.12,null,0.28000000000000003,0.34,0.02]
["Kosovo",0.11,0.42,0.2,0.12,0.08,7.0000000000000007E-2,null,0.53,0.2,0.01]
["Kyrgyz Rep.",0.12,0.37,0.18,0.14000000000000001,0.14000000000000001,0.03,null,0.49,0.28000000000000003,0.01]
["Latvia",0.03,0.28000000000000003,0.09,0.4,0.13,0.04,null,0.31000000000000005,0.53,0.02]
["Lithuania",0.04,0.22,0.17,0.36,0.18,0.02,null,0.26,0.54,0.01]
["Mongolia",0.1,0.39,0.15,0.21,0.12,0.02,null,0.49,0.32999999999999996,0]
["Montenegro",7.0000000000000007E-2,0.23,0.23,0.17,0.12,0.12,null,0.30000000000000004,0.29000000000000004,0.05]
["Poland",0.04,0.35,0.22,0.24,0.05,0.09,null,0.38999999999999996,0.28999999999999998,0]
["Romania",0.09,0.27,0.18,0.16,0.14000000000000001,0.15,null,0.36,0.30000000000000004,0.01]
["Russia",0.04,0.17,0.26,0.28000000000000003,0.14000000000000001,0.1,null,0.21000000000000002,0.42000000000000004,0.01]
["Serbia",0.11,0.22,0.19,0.21,0.16,0.09,null,0.33,0.37,0.03]
["Slovak Rep.",0.04,0.14000000000000001,0.18,0.35,0.23,0.04,null,0.18000000000000002,0.57999999999999996,0.02]
["Slovenia",0.06,0.22,0.1,0.3,0.25,0.06,null,0.28000000000000003,0.55000000000000004,0.02]
["Tajikistan",0.09,0.36,0.15,0.15,0.06,0.15,null,0.44999999999999996,0.21,0.02]
["Turkey",0.23,0.37,0.22,0.08,0.04,0.05,null,0.6,0.12,0.01]
[]
[null,"B",null,null,null,null,null,null,null,null,null,null,null,null,null,null,null,"Acceptable in society to report"]
["Country","Strongly agree","Agree","Neither","Disagree","Strongly disagree","Don’t know",null,"Total agree","Total disagree","Refusal"]
["Albania",0.05,0.42,0.19,0.24,7.0000000000000007E-2,0.01,null,{"$f":"B502+C502","v":0.47},{"$f":"F502+E502","v":0.31},0.02]
["Armenia",0.04,0.12,0.05,0.19,0.57999999999999996,0.02,null,{"$f":"B503+C503","v":0.16},{"$f":"F503+E503","v":0.77},0]
["Azerbaijan",0.04,0.34,0.2,0.12,0.04,0.26,null,0.38,0.16,0]
["Belarus",0.02,0.08,0.22,0.36,0.19,0.1,null,0.1,0.55000000000000004,0.03]
["Bosnia and Herz.",0.04,0.13,0.22,0.32,0.23,0.05,null,0.17,0.55000000000000004,0.01]
["Bulgaria",0.02,0.13,0.18,0.31,0.26,0.08,null,0.15,0.57000000000000006,0.02]
["Croatia",0.04,0.1,0.17,0.35,0.25,0.08,null,0.14000000000000001,0.6,0.02]
["Cyprus",0.13,0.38,0.18,0.22,0.04,0.03,null,0.51,0.26,0.01]
["Czech Rep.",0.05,0.31,0.24,0.3,7.0000000000000007E-2,0.03,null,0.36,0.37,0.01]
["Estonia",0.03,0.3,0.15,0.33,0.06,0.1,null,0.32999999999999996,0.39,0.01]
["Georgia",0.05,0.4,0.12,0.21,7.0000000000000007E-2,0.13,null,{"$f":"B512+C512","v":0.45},{"$f":"F512+E512","v":0.28000000000000003},0.01]
["Germany",0.27,0.36,0.15,0.09,0.04,0.09,null,0.63,0.13,0]
["Greece",0.15,0.44,0.2,0.17,0.03,0.01,null,0.59,0.2,0]
["Hungary",0.04,0.08,0.12,0.2,0.47,0.04,null,0.12,0.66999999999999993,0.04]
["Italy",0.16,0.49,0.17,0.09,7.0000000000000007E-2,0.02,null,0.65,0.16,0.01]
["Kazakhstan",0.03,0.22,0.25,0.28000000000000003,0.1,0.1,null,0.25,0.38,0.02]
["Kosovo",7.0000000000000007E-2,0.28999999999999998,0.3,0.19,7.0000000000000007E-2,0.08,null,0.36,0.26,0.01]
["Kyrgyz Rep.",0.08,0.41,0.24,0.13,0.09,0.04,null,0.49,0.22,0.01]
["Latvia",0.03,0.37,0.11,0.33,7.0000000000000007E-2,7.0000000000000007E-2,null,0.4,0.4,0.02]
["Lithuania",0.01,0.14000000000000001,0.13,0.49,0.2,0.02,null,0.15000000000000002,0.69,0.01]
["Mongolia",0.1,0.47,0.14000000000000001,0.2,0.06,0.03,null,0.56999999999999995,0.26,0]
["Montenegro",0.02,0.08,0.26,0.27,0.17,0.16,null,0.1,0.44000000000000006,0.05]
["Poland",0.02,0.22,0.23,0.3,0.06,0.16,null,0.24,0.36,0]
["Romania",0.09,0.31,0.15,0.2,0.1,0.13,null,0.4,0.30000000000000004,0.01]
["Russia",0.02,0.14000000000000001,0.2,0.42,0.15,0.06,null,0.16,0.56999999999999995,0.01]
["Serbia",0.06,0.15,0.19,0.3,0.2,0.09,null,0.21,0.5,0.02]
["Slovak Rep.",0.04,0.17,0.25,0.33,0.11,0.05,null,0.21000000000000002,0.44,0.03]
["Slovenia",0.05,0.2,0.12,0.33,0.22,7.0000000000000007E-2,null,0.25,0.55000000000000004,0.01]
["Tajikistan",0.02,0.24,0.22,0.26,0.08,0.16,null,0.26,0.34,0.02]
["Turkey",0.24,0.4,0.18,0.09,0.04,0.04,null,0.64,0.13,0.01]
[]
[null,"C",null,null,null,null,null,null,null,null,null,null,null,null,null,null,null,"Would feel obliged"]
["Country","Strongly agree","Agree","Neither","Disagree","Strongly disagree","Don’t know",null,"Total agree","Total disagree","Refusal"]
["Albania",0.13,0.5,0.2,0.11,0.02,0.02,null,{"$f":"B535+C535","v":0.63},{"$f":"F535+E535","v":0.13},0.02]
["Armenia",0.11,0.13,7.0000000000000007E-2,0.14000000000000001,0.52,0.03,null,{"$f":"B536+C536","v":0.24},{"$f":"F536+E536","v":0.66},0]
["Azerbaijan",0.05,0.38,0.17,0.14000000000000001,0.04,0.21,null,0.43,0.18000000000000002,0.01]
["Belarus",0.02,0.09,0.25,0.36,0.14000000000000001,0.11,null,0.11,0.5,0.04]
["Bosnia and Herz.",0.08,0.25,0.28000000000000003,0.2,0.1,7.0000000000000007E-2,null,0.33,0.30000000000000004,0.02]
["Bulgaria",0.05,0.24,0.26,0.13,0.17,0.13,null,0.28999999999999998,0.30000000000000004,0.03]
["Croatia",0.09,0.32,0.23,0.14000000000000001,0.08,0.1,null,{"$f":"B541+C541","v":0.41000000000000003},{"$f":"F541+E541","v":0.22000000000000003},0.04]
["Cyprus",0.22,0.47,0.16,0.08,0.04,0.03,null,0.69,0.12,0]
["Czech Rep.",0.05,0.34,0.28999999999999998,0.22,0.04,0.04,null,0.39,0.26,0.01]
["Estonia",0.09,0.39,0.17,0.18,0.05,0.1,null,0.48,0.22999999999999998,0.02]
["Georgia",0.05,0.33,0.12,0.27,0.09,0.13,null,0.38,0.36,0.01]
["Germany",0.19,0.5,0.21,0.05,0.02,0.02,null,0.69,7.0000000000000007E-2,0.01]
["Greece",0.19,0.5,0.18,0.09,0.02,0.02,null,0.69,0.11,0]
["Hungary",7.0000000000000007E-2,0.14000000000000001,0.19,0.18,0.3,0.06,null,0.21000000000000002,0.48,0.06]
["Italy",0.16,0.45,0.24,7.0000000000000007E-2,0.05,0.03,null,0.61,0.12000000000000001,0.01]
["Kazakhstan",0.04,0.28000000000000003,0.25,0.21,7.0000000000000007E-2,0.11,null,0.32,0.28000000000000003,0.02]
["Kosovo",0.11,0.5,0.19,0.1,0.03,0.06,null,0.61,0.13,0.01]
["Kyrgyz Rep.",0.09,0.36,0.25,0.15,7.0000000000000007E-2,0.05,null,0.44999999999999996,0.22,0.03]
["Latvia",0.06,0.43,0.13,0.25,0.06,0.05,null,0.49,0.31,0.02]
["Lithuania",0.05,0.32,0.24,0.26,0.08,0.04,null,0.37,0.34,0.01]
["Mongolia",0.13,0.56999999999999995,0.1,0.13,0.05,0.02,null,0.7,0.18,0]
["Montenegro",7.0000000000000007E-2,0.28000000000000003,0.28000000000000003,0.13,0.05,0.13,null,0.35000000000000003,0.18,0.06]
["Poland",0.04,0.32,0.26,0.18,0.03,0.16,null,0.36,0.21,0.01]
["Romania",0.08,0.32,0.19,0.15,0.1,0.15,null,0.4,0.25,0.03]
["Russia",0.02,0.16,0.3,0.26,0.11,0.12,null,0.18,0.37,0.02]
["Serbia",0.08,0.26,0.24,0.18,0.1,0.11,null,0.34,0.28000000000000003,0.03]
["Slovak Rep.",0.03,0.17,0.27,0.25,0.15,0.08,null,0.2,0.4,0.05]
["Slovenia",0.12,0.38,0.14000000000000001,0.14000000000000001,0.12,0.09,null,0.5,0.26,0.02]
["Tajikistan",0.02,0.28000000000000003,0.28000000000000003,0.2,0.04,0.15,null,0.30000000000000004,0.24000000000000002,0.04]
["Turkey",0.28000000000000003,0.33,0.22,7.0000000000000007E-2,0.03,0.05,null,0.6100000000000001,0.1,0.01]
[]
[null,"D",null,null,null,null,null,null,null,null,null,null,null,null,null,null,null,"Would report even if one day in court"]
["Country","Strongly agree","Agree","Neither","Disagree","Strongly disagree","Don’t know",null,"Total agree","Total disagree","Refusal"]
["Albania",0.13,0.39,0.2,0.17,0.04,0.04,null,{"$f":"B568+C568","v":0.52},{"$f":"F568+E568","v":0.21000000000000002},0.02]
["Armenia",0.08,0.1,0.06,0.11,0.62,0.03,null,{"$f":"B569+C569","v":0.18},{"$f":"F569+E569","v":0.73},0]
["Azerbaijan",0.05,0.33,0.17,0.18,0.05,0.2,null,0.38,0.22999999999999998,0.02]
["Belarus",0.01,0.06,0.23,0.34,0.2,0.12,null,6.9999999999999993E-2,0.54,0.04]
["Bosnia and Herz.",7.0000000000000007E-2,0.2,0.28999999999999998,0.22,0.14000000000000001,7.0000000000000007E-2,null,0.27,0.36,0.02]
["Bulgaria",0.04,0.18,0.25,0.16,0.22,0.11,null,0.22,0.38,0.03]
["Croatia",0.08,0.25,0.24,0.18,0.11,0.11,null,0.33,0.28999999999999998,0.03]
["Cyprus",0.18,0.4,0.16,0.14000000000000001,7.0000000000000007E-2,0.04,null,0.58000000000000007,0.21000000000000002,0.01]
["Czech Rep.",0.03,0.25,0.27,0.3,7.0000000000000007E-2,0.05,null,0.28000000000000003,0.37,0.01]
["Estonia",7.0000000000000007E-2,0.33,0.16,0.23,0.09,0.1,null,0.4,0.32,0.02]
["Georgia",0.04,0.27,0.11,0.3,0.1,0.15,null,0.31,0.4,0.02]
["Germany",0.15,0.36,0.28999999999999998,0.1,7.0000000000000007E-2,0.02,null,{"$f":"B579+C579","v":0.51},{"$f":"F579+E579","v":0.17},0.01]
["Greece",0.12,0.39,0.24,0.18,0.05,0.03,null,0.51,0.22999999999999998,0]
["Hungary",0.06,0.13,0.13,0.16,0.41,0.05,null,0.19,0.56999999999999995,0.06]
["Italy",0.13,0.36,0.23,0.13,0.11,0.04,null,0.49,0.24,0.01]
["Kazakhstan",0.04,0.24,0.22,0.26,0.11,0.11,null,0.27999999999999997,0.37,0.02]
["Kosovo",0.1,0.45,0.22,0.1,0.05,7.0000000000000007E-2,null,0.55000000000000004,0.15000000000000002,0.01]
["Kyrgyz Rep.",0.1,0.34,0.24,0.16,0.08,0.05,null,0.44000000000000006,0.24,0.03]
["Latvia",0.06,0.32,0.13,0.34,0.09,0.05,null,0.38,0.43000000000000005,0.02]
["Lithuania",0.04,0.2,0.21,0.35,0.14000000000000001,0.05,null,0.24000000000000002,0.49,0.01]
["Mongolia",0.1,0.45,0.14000000000000001,0.2,0.09,0.02,null,0.55000000000000004,0.29000000000000004,0]
["Montenegro",0.06,0.21,0.27,0.15,0.08,0.16,null,0.27,0.22999999999999998,0.06]
["Poland",0.04,0.25,0.21,0.28000000000000003,0.04,0.17,null,0.28999999999999998,0.32,0.01]
["Romania",7.0000000000000007E-2,0.28999999999999998,0.16,0.18,0.13,0.15,null,0.36,0.31,0.02]
["Russia",0.02,0.11,0.31,0.32,0.12,0.1,null,0.13,0.44,0.03]
["Serbia",0.08,0.21,0.26,0.19,0.11,0.11,null,0.28999999999999998,0.3,0.03]
["Slovak Rep.",0.02,0.13,0.24,0.28000000000000003,0.2,0.08,null,0.15,0.48000000000000004,0.05]
["Slovenia",0.09,0.32,0.14000000000000001,0.19,0.16,0.09,null,0.41000000000000003,0.35,0.02]
["Tajikistan",0.02,0.22,0.25,0.23,0.06,0.17,null,0.24,0.29000000000000004,0.05]
["Turkey",0.28999999999999998,0.33,0.2,0.08,0.04,0.05,null,0,0,0.01]
[]
[]
["QUESTION 8",null,null,null,null,null,null,null,null,null,null,null,null,null,null,null,null,"Wealthy individuals often use their influence on government for their own interests and there should be stricter rules to prevent this."]
["Country","1 - There is no problem with the influence of wealthy individuals on the way government is run in this country","2","3","4","5","6","7","8","9","10 - Wealthy individuals often use their influence on government for their own interests and there need to be stricter rules to prevent this. ","Don't know"]
["Albania",0.11,0.05,0.04,0.05,0.08,0.08,7.0000000000000007E-2,0.1,0.13,0.18,0.1]
["Armenia",7.0000000000000007E-2,0.03,0.03,0.02,0.06,0.05,0.02,7.0000000000000007E-2,0.13,0.43,0.08]
["Azerbaijan",0.13,0.03,0.06,0.08,0.12,0.02,0.01,0.01,0.01,0.41,0.13]
["Belarus",0.09,7.0000000000000007E-2,0.08,0.08,0.22,0.09,0.08,0.09,0.05,0.06,7.0000000000000007E-2]
["Bosnia and Herz.",0.05,0.03,0.02,0.03,0.05,7.0000000000000007E-2,7.0000000000000007E-2,0.06,0.14000000000000001,0.32,0.16]
["Bulgaria",7.0000000000000007E-2,0.02,0.04,0.03,0.04,0.06,0.05,0.06,0.1,0.23,0.3]
["Croatia",0.02,0.03,0.03,0.04,0.06,7.0000000000000007E-2,0.03,0.05,0.12,0.27,0.28000000000000003]
["Cyprus",0.02,0.03,0.01,0.01,0.02,0.01,0.02,0.06,0.19,0.47,0.17]
["Czech Rep.",0.03,0.03,0.04,0.03,7.0000000000000007E-2,7.0000000000000007E-2,7.0000000000000007E-2,0.11,0.11,0.36,0.08]
["Estonia",0.03,0.03,0.04,0.04,0.08,0.1,0.08,0.15,0.11,0.26,0.08]
["Georgia",0.1,0.04,0.06,0.04,0.1,0.05,0.05,0.08,0.06,0.28999999999999998,0.13]
["Germany",0.02,0.01,0.01,0.02,0.04,0.02,0.06,0.18,0.28999999999999998,0.24,0.11]
["Greece",0.01,0.01,0.02,0.03,0.05,0.05,0.04,0.08,0.17,0.35,0.17]
["Hungary",0.04,0.03,0.04,0.05,0.06,0.11,0.06,7.0000000000000007E-2,0.1,0.22,0.22]
["Italy",0.09,0.04,7.0000000000000007E-2,0.06,7.0000000000000007E-2,0.06,7.0000000000000007E-2,0.11,0.1,0.24,0.11]
["Kazakhstan",0.09,0.04,7.0000000000000007E-2,0.05,0.16,0.1,0.08,0.11,0.12,0.15,0.03]
["Kosovo",0.05,0.06,7.0000000000000007E-2,0.08,0.1,0.09,0.04,0.04,0.08,0.19,0.2]
["Kyrgyz Rep.",0.05,0.03,0.06,0.13,0.21,0.13,0.1,7.0000000000000007E-2,0.05,0.15,0.02]
["Latvia",0.04,0.02,0.01,0.02,0.05,0.04,0.05,0.13,0.14000000000000001,0.41,0.08]
["Lithuania",0.04,0.02,0.02,0.01,0.03,0.05,0.04,0.09,0.14000000000000001,0.43,0.13]
["Mongolia",0.06,0.02,0.03,0.04,0.04,0.05,0.04,0.08,0.14000000000000001,0.47,0.03]
["Montenegro",0.08,0.02,0.03,0.03,0.06,0.1,0.05,0.05,0.06,0.24,0.28000000000000003]
["Poland",0.04,0.04,0.04,0.05,0.05,0.03,0.14000000000000001,0.19,0.15,0.12,0.13]
["Romania",0.05,0.02,0.03,0.04,0.04,0.06,0.04,0.05,0.1,0.35,0.24]
["Russia",0.04,0.03,0.04,0.04,7.0000000000000007E-2,0.1,0.08,0.11,0.12,0.27,0.1]
["Serbia",0.05,0.02,0.02,0.04,0.06,0.09,0.04,0.06,0.11,0.22,0.28999999999999998]
["Slovak Rep.",0.05,0.03,0.03,0.02,0.05,0.14000000000000001,0.06,0.06,0.12,0.31,0.12]
["Slovenia",0.03,0.02,0.03,0.01,0.05,0.05,0.1,7.0000000000000007E-2,0.09,0.37,0.18]
["Tajikistan",0.06,0.03,0.09,0.15,0.15,0.08,0.08,0.12,7.0000000000000007E-2,0.1,7.0000000000000007E-2]
["Turkey",0.05,7.0000000000000007E-2,0.08,7.0000000000000007E-2,0.06,0.04,0.05,0.1,0.13,0.18,0.17]
[]
[]
["QUESTION 8B",null,null,null,null,null,null,null,null,null,null,null,null,null,null,null,null,"Financial support by companies to political parties and candidates should be banned completely"]
["Country","1 - Financial support by companies to political parties and candidates should be banned completely","2","3","4","5","6","7","8","9","10 - There should be no limits on financial support by companies to political parties or candidates","Don’t know"]
["Albania",0.22,0.14000000000000001,0.09,0.08,0.09,0.09,0.06,0.05,0.05,7.0000000000000007E-2,0.06]
["Armenia",0.28999999999999998,7.0000000000000007E-2,0.05,0.03,0.1,0.09,0.03,0.05,0.05,0.12,0.13]
["Azerbaijan",0.26,0.02,0.06,0.05,0.13,0.04,0.02,0.01,0,0.18,0.22]
["Belarus",0.12,0.1,0.09,0.1,0.26,0.1,0.05,0.02,0.02,0.02,0.11]
["Bosnia and Herz.",0.28000000000000003,0.15,0.12,7.0000000000000007E-2,7.0000000000000007E-2,0.11,0.06,0.03,0.03,0.03,0.06]
["Bulgaria",0.4,0.1,0.09,7.0000000000000007E-2,0.05,0.09,0.04,0.03,0.02,0.03,0.08]
["Croatia",0.3,0.11,0.1,0.08,0.09,0.13,0.05,0.03,0.02,0.03,0.05]
["Cyprus",0.41,0.15,0.06,0.04,7.0000000000000007E-2,0.05,0.02,0.02,0.03,0.06,0.1]
["Czech Rep.",0.32,0.11,0.11,0.05,0.09,0.11,0.06,0.03,0.03,0.05,0.04]
["Estonia",0.33,0.11,0.09,0.06,0.1,0.1,0.05,0.03,0.02,7.0000000000000007E-2,0.06]
["Georgia",0.21,0.08,7.0000000000000007E-2,0.06,0.12,0.05,0.04,0.05,0.04,0.12,0.16]
["Germany",0.14000000000000001,0.16,0.21,0.18,0.14000000000000001,0.03,0.05,0.02,0.03,0.02,0.03]
["Greece",0.35,0.18,0.11,0.08,0.06,0.1,0.04,0.04,0.02,0,0.03]
["Hungary",0.3,0.06,0.06,0.06,0.11,0.14000000000000001,0.08,0.06,0.04,0.04,0.04]
["Italy",0.33,0.08,7.0000000000000007E-2,0.05,0.06,0.1,0.06,7.0000000000000007E-2,0.06,0.09,0.04]
["Kazakhstan",0.19,0.1,0.11,0.08,0.21,0.09,0.05,0.03,0.02,0.05,7.0000000000000007E-2]
["Kosovo",0.16,0.09,0.11,0.1,0.12,0.08,0.03,0.05,0.05,0.06,0.15]
["Kyrgyz Rep.",0.15,0.06,0.09,0.13,0.26,0.11,0.06,0.04,0.04,0.06,0.02]
["Latvia",0.33,0.1,0.1,7.0000000000000007E-2,0.16,0.06,0.02,0.03,0.01,0.06,7.0000000000000007E-2]
["Lithuania",0.37,0.12,7.0000000000000007E-2,0.05,0.1,0.09,0.03,0.03,0.02,0.05,7.0000000000000007E-2]
["Mongolia",0.38,0.11,0.06,0.05,0.09,0.05,0.04,0.05,0.05,0.1,0.01]
["Montenegro",0.36,0.04,0.04,0.04,7.0000000000000007E-2,0.12,0.05,0.03,0.03,7.0000000000000007E-2,0.16]
["Poland",0.28000000000000003,0.08,0.09,0.12,0.12,0.09,0.08,0.05,0.03,0.02,0.02]
["Romania",0.43,0.1,7.0000000000000007E-2,0.04,0.05,0.1,0.04,0.03,0.02,0.04,0.09]
["Russia",0.18,0.11,0.08,7.0000000000000007E-2,0.12,0.13,0.06,0.05,0.04,0.06,0.1]
["Serbia",0.38,0.1,0.08,0.04,0.06,0.1,0.05,0.04,0.04,0.05,0.05]
["Slovak Rep.",0.35,0.09,0.06,0.05,7.0000000000000007E-2,0.18,0.08,0.02,0.03,0.03,0.05]
["Slovenia",0.39,0.08,7.0000000000000007E-2,0.03,0.15,0.08,0.02,0.03,0.02,0.04,0.09]
["Tajikistan",0.05,0.04,0.09,0.16,0.17,0.11,0.08,0.08,7.0000000000000007E-2,0.06,0.09]
["Turkey",0.1,0.09,0.09,0.08,0.1,7.0000000000000007E-2,0.04,0.08,0.12,0.1,0.11]

{"sheet":"General stats","index":5,"n_rows":259,"n_cols":9,"rows_kept":259,"cut":false,"hidden":true,"merged":[[113,1,113,5]]}
["VARIABLE","DESCRIPTION"]
[]
["_SEXE","Please indicate your gender"]
["Country","Male ","Female","Total"]
[null,"%","%","%"]
["Albania",0.49500665636706537,0.50499334363293313,{"$f":"B6+C6","v":0.99999999999999845}]
["Armenia",0.46445097437266453,0.53554902562733808,{"$f":"B7+C7","v":1.0000000000000027}]
["Azerbaijan",0.4814679004143666,0.51853209958563629,1.0000000000000029]
["Belarus",0.45362347191066726,0.54637652808933279,1]
["Bosnia and Herz.",0.49899976631082926,0.50100023368917279,1.000000000000002]
["Bulgaria",0.48070522065425353,0.5192947793457442,0.99999999999999778]
["Croatia",0.47532109106557585,0.52467890893442004,0.99999999999999589]
["Cyprus",0.47979804505051038,0.52020195494948973,1]
["Czech Rep.",0.48467013251117452,0.51532986748882914,1.0000000000000036]
["Estonia",0.45725771013340633,0.54274228986659967,1.000000000000006]
["FYR Macedonia",0,0,0]
["Georgia",0.45821783737426791,0.54178216262573398,1.0000000000000018]
["Germany",0.48622214073482029,0.51377785926518205,1.0000000000000022]
["Greece",0.48446488518169872,0.51553511481830305,1.0000000000000018]
["Hungary",0.46530325689667829,0.53469674310332072,0.999999999999999]
["Italy",0.47938729668244284,0.52061270331755516,0.999999999999998]
["Kazakhstan",0.46964995620564737,0.53035004379435313,1.0000000000000004]
["Kosovo",0.49618700335875365,0.5038129966412479,1.0000000000000016]
["Kyrgyz Rep.",0.4856435036204631,0.51435649637953618,0.99999999999999933]
["Latvia",0.45676460609019753,0.54323539390980691,1.0000000000000044]
["Lithuania",0.44947260260880745,0.55052739739119116,0.99999999999999867]
["Moldova",0,0,0]
["Mongolia",0.48086364692181532,0.51913635307818062,0.999999999999996]
["Montenegro",0.48619930341727197,0.51380069658273486,1.0000000000000069]
["Poland",0.47745328288239913,0.5225467171176017,1.0000000000000009]
["Romania",0.48377751320835338,0.51622248679164917,1.0000000000000027]
["Russia",0.45153640448581106,0.54846359551418744,0.99999999999999845]
["Serbia",0.48096759745014206,0.5190324025498565,0.99999999999999856]
["Slovak Rep.",0.4814781402320274,0.51852185976797149,0.99999999999999889]
["Slovenia",0.49155516774880825,0.50844483225118997,0.99999999999999822]
["Tajikistan",0.49874694087866023,0.50125305912134288,1.0000000000000031]
["Turkey",0.49258680310833081,0.50741319689166786,0.99999999999999867]
["Ukraine",0,0,0]
[]
["_URBAN","Do you live in an urban or rural area?"]
["Country","Rural","Semi-Urban","Urban","Total"]
[null,"%","%","%","%"]
["Albania",0.45336032053495245,null,0.5466396794650461,{"$f":"B43+C43+D43","v":0.99999999999999856}]
["Armenia",0.3573123781524184,null,0.64268762184758199,{"$f":"B44+C44+D44","v":1.0000000000000004}]
["Azerbaijan",0.45434582235780846,null,0.54565417764219426,1.0000000000000027]
["Belarus",0.22850481116711208,null,0.77149518883288748,0.99999999999999956]
["Bosnia and Herz.",0.40000016677788497,null,0.59999983322211625,1.0000000000000013]
["Bulgaria",0.26968661093143315,null,0.73031338906856336,0.99999999999999645]
["Croatia",0.38643311072970976,null,0.61356688927028757,0.99999999999999734]
["Cyprus",0.32186958574956681,null,0.67813041425043508,1.0000000000000018]
["Czech Rep.",0.37808972529482093,null,0.62191027470518279,1.0000000000000038]
["Estonia",0.36492648191705274,null,0.63507351808295065,1.0000000000000033]
["FYR Macedonia",0,null,0,0]
["Georgia",0.51855914677034431,null,0.48144085322965779,1.0000000000000022]
["Germany",0.24999995333333644,null,0.75000004666666586,1.0000000000000022]
["Greece",0.21991702865361148,null,0.78008297134638827,0.99999999999999978]
["Hungary",0.30086558858869683,null,0.69913441141130117,0.999999999999998]
["Italy",0.11990308683086802,null,0.88009691316913152,0.99999999999999956]
["Kazakhstan",0.42864779591989005,null,0.57135220408011156,1.0000000000000016]
["Kosovo",0.6076614959489236,null,0.39233850405107729,1.0000000000000009]
["Kyrgyz Rep.",0.64484322043646902,null,0.35515677956353042,0.99999999999999944]
["Latvia",0.3163764242183541,null,0.6836235757816489,1.0000000000000031]
["Lithuania",0.32658284490507272,null,0.67341715509492528,0.999999999999998]
["Moldova",0,null,0,0]
["Mongolia",0.3306665422577782,null,0.66933345774221764,0.99999999999999578]
["Montenegro",0.4639832254981342,null,0.5360167745018739,1.000000000000008]
["Poland",0.38691964107172644,null,0.61308035892827373,1.0000000000000002]
["Romania",0.45021630262371359,null,0.54978369737628974,1.0000000000000033]
["Russia",0.24890856121228036,null,0.751091438787719,0.99999999999999933]
["Serbia",0.40695796758174618,null,0.59304203241825115,0.99999999999999734]
["Slovak Rep.",0.53239684753351535,null,0.4676031524664841,0.99999999999999944]
["Slovenia",0,null,0,0]
["Tajikistan",0.72362572205104536,null,0.27637427794895353,0.99999999999999889]
["Turkey",6.7780525867985636E-2,null,0.932219474132014,0.99999999999999967]
["Ukraine",0,null,0,0]
[]
["_AGE","Grouped results"]
["Country","18-24","25-34","35-54","55+"]
[null,"%","%","%","%"]
["Albania",0.17043089689252025,0.19324275826123199,0.33979725372116837,0.29652909112507836]
["Armenia",0.1702036543629466,0.22513597479250738,0.33666039960682631,0.26799997123771985]
["Azerbaijan",0.2076546690197717,0.24369007329147224,0.38360047102260902,0.16505478666615175]
["Belarus",0.10744103558568635,0.19460103299339873,0.35572088756679693,0.34223704385411691]
["Bosnia and Herz.",0.11800198492367957,0.18787821638656824,0.36710499675216818,0.32701480193758686]
["Bulgaria",8.8145575116580985E-2,0.16696280549435333,0.33757703690074481,0.4073145824883187]
["Croatia",0.10335656597296969,0.16486832604967983,0.34657924908070387,0.38519585889664187]
["Cyprus",0.1315538238576392,0.21352247041513109,0.35035252136153522,0.30457118436569497]
["Czech Rep.",0.10707005477748524,0.17041897660213287,0.35435844390770155,0.36815252471268328]
["Estonia",9.6857663189946167E-2,0.17899616753726297,0.33352474389531106,0.39062142537748401]
["FYR Macedonia",0,0,0,0]
["Georgia",0.1200926188273638,0.18131650111506312,0.32710376695004117,0.37148711310753368]
["Germany",9.1470561788236898E-2,0.12535790664757857,0.37053136690499455,0.41264016465919179]
["Greece",9.9561676880012606E-2,0.15393653815753175,0.36113364676851939,0.38536813819393939]
["Hungary",0.10555141816999296,0.18424798936638198,0.32651347554659338,0.38368711691703195]
["Italy",8.3502452268699845E-2,0.12674659991809303,0.37814145180438868,0.41160949600881602]
["Kazakhstan",0.18219040230279884,0.2109635457334928,0.3957480610448128,0.21109799091889705]
["Kosovo",0.20206846531954403,0.23751892508320752,0.35534517763103257,0.20506743196621749]
["Kyrgyz Rep.",0.21361251572774928,0.26182828809676689,0.35385077958965083,0.17070841658583141]
["Latvia",9.204126122721723E-2,0.17785347570471366,0.34738639129848697,0.38271887176958685]
["Lithuania",0.11621963791699585,0.16333208867424179,0.33377641571399513,0.38667185769476559]
["Moldova",0,0,0,0]
["Mongolia",0.1885087241532169,0.26995565640059077,0.39569491472406637,0.14584070472212396]
["Montenegro",0.12753264932988578,0.2067608014056054,0.33966780124623219,0.32603874801828181]
["Poland",0.10504380210087612,0.17817046356340943,0.35067796701355936,0.36610776732215539]
["Romania",9.5302446788200296E-2,0.14960685607018892,0.37726442258728304,0.37782627455432966]
["Russia",0.1032259729435442,0.19229800443637857,0.36629633891471336,0.33817968370536233]
["Serbia",0.10194332646613527,0.16929648347973264,0.32782901356275973,0.40093117649137106]
["Slovak Rep.",0.11262365220847932,0.17671699102160571,0.37540910623881357,0.33525025053110047]
["Slovenia",8.5434605239939815E-2,0.15595754781070467,0.36590438976926465,0.39270345718008814]
["Tajikistan",0.27198202135789967,0.2511017446099269,0.35274934132806768,0.12416689270410776]
["Turkey",0.15528848787180721,0.24511157765355718,0.35948227255149073,0.24011766192314393]
["Ukraine",0,0,0,0]
[]
["_EDUCATION","What is the highest level of education you attained?"]
["Country","No degree/No education","Primary education","Lower secondary education","(Upper) secondary education","Post-secondary non-tertiary education","Tertiary education (not a university diploma)","Bachelor's degree or more","Master's degree or PhD"]
[null,"%","%","%","%","%","%","%","%"]
["Albania",0,0.11804562688571631,0.31715847311485235,0.38163320528024769,5.387929900146385E-3,3.2761408616224556E-2,0.13157201917617245,1.3441337026640621E-2]
["Armenia",0,3.5652198599217241E-2,0.10158497254865086,0.32012815319718368,0.27293466815625284,3.8733078068700279E-2,0.14607214042722028,8.4894789002774473E-2]
["Azerbaijan",0,0,0.34791744346719888,0.28231965433290196,0,0.36976290219989905,0,0]
["Belarus",0,0,3.6699535412703321E-2,0.30915226550532277,0.34352964068135505,0.25620241377212299,5.441614462849538E-2,0]
["Bosnia and Herz.",1.8564261937875047E-2,0.16458727585292646,0.35282766539891064,0.30542563249778343,4.3276418707621264E-2,5.0716461488083189E-2,5.7552995167850368E-2,7.0492889489495846E-3]
["Bulgaria",4.1963910339177686E-2,0.19373344491914815,0,0.53482866010611885,5.942863783880796E-2,5.5691645105595258E-3,7.9180853768576198E-2,8.5295328517611985E-2]
["Croatia",2.3561118054255214E-2,0.16643151906800255,0.22945184663441356,0.43852564088607077,1.0127041393234998E-2,6.0805522049441917E-2,3.4949764416942801E-2,3.6147547497637614E-2]
["Cyprus",0,0.20483770594460401,0.16376287301542269,0.41761029066122385,4.4922945950070584E-2,6.1638650467950355E-2,9.7471792341342775E-2,9.7557416193857979E-3]
["Czech Rep.",0,0,0,0,0,0,0,0]
["Estonia",0,8.5969518755761726E-3,6.9652274643253798E-2,0.28651558600480193,0.33816116785237293,0.12404873063024556,9.652765145342844E-2,7.6497637540321628E-2]
["FYR Macedonia",0,0,0,0,0,0,0,0]
["Georgia",0,3.4378690560215516E-2,0.1132813627237986,0.3031248108274297,0.14749656478885251,0.15649787031012044,0.14181981463203588,0.10340088615754736]
["Germany",0,0.13678647167649383,2.964729618915625E-2,0.34166741966370096,0.15028102697765655,6.1111542405187062E-3,0.13538271551517514,0.20012391573729865]
["Greece",7.4310282885618247E-3,0.19735953046577065,0.17206194664821742,0.46203849739307395,3.5415032130375071E-2,3.0114303786615663E-2,9.5579661287385612E-2,0]
["Hungary",1.0167943208798708E-2,0.27539761016448377,0.18364121149118953,0.33939296109570949,6.7424210289683012E-2,9.6552278859046756E-2,2.1582133161250641E-2,5.841651729838155E-3]
["Italy",1.9717665236162639E-3,7.7069888283780127E-2,0.25933543507263873,0.48485547368708848,3.075933739774888E-2,2.7839012893681007E-3,0.1179998139245199,2.5224383821239725E-2]
["Kazakhstan",8.3123003167545392E-3,1.0525928230389447E-2,3.9361287479808549E-2,0.27233289275023409,0.35620106099042681,0.26744733175921348,4.5819198473173117E-2,0]
["Kosovo",0.111745000472369,0.31200355629824861,0.11816453869482273,0.28871561950497848,1.4425311814107913E-2,3.7800114427902383E-2,0.11261119330620845,4.5346654813623218E-3]
["Kyrgyz Rep.",5.4234076648953009E-2,6.7469515708282277E-3,8.2956932417013698E-2,0.2447144153865905,0.2908633739371817,0.31254124903017266,7.9430010092602713E-3,0]
["Latvia",0,1.7214827691263646E-2,0.10385143753504282,0.25355515914034465,0.317734650803628,6.9702928536721206E-2,0.1331261471436343,0.10481484914936549]
["Lithuania",1.7926335821170761E-2,1.8857343440193696E-2,8.5620302906752391E-2,0.19862324514752058,0.2513670105179,0.21873875414071897,0.15262898907139219,5.6238018954350606E-2]
["Moldova",0,0,0,0,0,0,0,0]
["Mongolia",0,7.439086975519317E-2,0.20329374118198915,0.35502928979500115,8.7160797277522462E-2,0.14512884411683183,0.12779587313733837,7.2005847361246737E-3]
["Montenegro",9.5287343456140674E-3,0.10175049403460409,0.18295076850519595,0.43148343496969671,9.9137364526691793E-2,2.7335494118534441E-2,0.14781370949966291,0]
["Poland",0,7.7512084804607417E-2,9.6210374301993043E-2,0.53678509034918243,1.4267040253071479E-3,5.303526616180684E-3,3.0766438171943512E-2,0.25199578173078585]
["Romania",2.1194344080209662E-2,4.2344405936631441E-2,0.32870645185066011,0.25898473442157305,0.21591353534216778,2.1212671175065957E-2,0.10355388126261594,8.0899759310758563E-3]
["Russia",0,0,4.8962002849871393E-2,0.32738380250602489,0.28227385051300558,0.29451325962185271,4.6867084509245129E-2,0]
["Serbia",2.1346887656344925E-2,0.1551979078982606,0.2133792433723237,0.39816704306601364,0.12155776051632836,1.8991040412922669E-2,6.6252472955935324E-2,5.1076441218707684E-3]
["Slovak Rep.",0,0.12670177849826952,0.30322102169391907,0.35591827077823451,2.5217702646188347E-2,1.0317795793937507E-2,1.6367887254581995E-2,0.16225554333486922]
["Slovenia",5.072096024239592E-3,0.25155636693523026,0.21145272890038583,0.35934254294174506,5.8956688493079307E-2,1.8328797391608951E-2,8.6140003413183841E-2,9.1507759005266462E-3]
["Tajikistan",1.6998958086539704E-2,4.9784031691247517E-2,9.1312591834094958E-2,0.38565881832357862,0.13595084498524063,0.13809796886347053,0.1644384285720609,1.7758357643767014E-2]
["Turkey",0,0.17012037199625543,9.8238051141016663E-2,0.34897068856771524,0.14182226948520982,0.13139184897796299,9.3477681194582718E-2,1.597908863725821E-2]
["Ukraine",0,0,0,0,0,0,0,0]
[]
["Sample size"]
["Country"]
["Albania",1500]
["Armenia",1527]
["Azerbaijan",1510]
["Belarus",1504]
["Bosnia and Herz.",1499]
["Bulgaria",1500]
["Croatia",1503]
["Cyprus",1500]
["Czech Rep.",1532]
["Estonia",1503]
["FYR Macedonia"]
["Georgia",1508]
["Germany",1500]
["Greece",1503]
["Hungary",1497]
["Italy",1501]
["Kazakhstan",1505]
["Kosovo",1500]
["Kyrgyz Rep.",1500]
["Latvia",1482]
["Lithuania",1501]
["Moldova"]
["Mongolia",1500]
["Montenegro",1503]
["Poland",1500]
["Romania",1512]
["Russia",1507]
["Serbia",1508]
["Slovak Rep.",1544]
["Slovenia",1501]
["Tajikistan",1510]
["Turkey",1500]
["Ukraine"]
[]
["Total",45164]
[]
[]
["Dates","Start","End"]
["Albania",null,null,"no data"]
["Armenia","2015-12-28","2016-05-05"]
["Azerbaijan","2015-12-28","2016-05-05"]
["Belarus","2016-04-02","2016-05-22"]
["Bosnia and Herz.","2016-12-17","2016-02-10"]
["Bulgaria","2016-12-11","2016-02-01"]
["Croatia","2015-12-31","2016-02-19"]
["Cyprus",null,null,"no data"]
["Czech Rep.","2016-01-13","2016-05-01"]
["Estonia","2016-12-19","2016-02-15"]
["FYR Macedonia",null,null,"no data"]
["Georgia","2016-02-20","2016-05-30"]
["Germany",null,null,"no data"]
["Greece","2015-11-18","2016-02-18"]
["Hungary","2015-12-09","2016-05-08"]
["Italy","2016-01-18","2016-03-01","first date 01/01/2010"]
["Kazakhstan","2016-03-01","2016-05-19"]
["Kosovo","2016-03-01","2016-05-19"]
["Kyrgyz Rep.","2015-12-12","2016-03-02"]
["Latvia","2015-12-19","2016-03-14"]
["Lithuania","2016-12-04","2016-01-28"]
["Moldova",null,null,"no data"]
["Mongolia","2015-11-25","2015-12-24","First 3: 2009"]
["Montenegro","2015-11-28","2016-03-07","first date 03/01/2010"]
["Poland",null,null,"no data"]
["Romania","2016-02-02","2016-04-01"]
["Russia","2016-01-21","2016-04-20","First interviews from 2000 (+ 1982 is listed)"]
["Serbia","2015-11-26","2016-02-22","First one from 2009"]
["Slovak Rep.","2015-12-06","2016-05-01"]
["Slovenia","2015-12-09","2016-05-23"]
["Tajikistan","2016-01-18","2016-02-15","First interviews from 2014"]
["Turkey",null,null,"no data"]
["Ukraine","2016-02-02",null,"Wrong last dates: ",null,20161412203300]
[]
["Marital Status"]
["Country","Single (nevermarried)","Married","Widowed","Divorced","Separated"]
["Albania",8.9550587144486424E-2,0.83253039620384073,6.0962597158269974E-2,1.1532725328552278E-2,5.423694164850998E-3]
["Armenia",8.9202690061712747E-2,0.75302778440374041,0.12164116806827149,2.9263161327391526E-2,6.8651961388837782E-3]
["Azerbaijan",1,0,0,0,0]
["Belarus",0.15582884693592167,0.60965263407460912,0.12862990476045427,9.8838372812620159E-2,7.0502414163942807E-3]
["Bosnia and Herz.",0.14321532153028735,0.70801028770883245,9.4285168207604894E-2,4.1824583384207345E-2,1.2664639169067333E-2]
["Bulgaria",0.10613665897281234,0.57231667480919091,0.17826981541396431,0.12833583840579355,1.4941012398239226E-2]
["Croatia",0.1256163552412512,0.610563733708408,0.13937865875873989,0.10395905274708998,2.0482199544510377E-2]
["Cyprus",0.10198598197995726,0.77356510277736523,6.4823746521502024E-2,5.9625168721175549E-2,0]
["Czech Rep.",0,0,0,0,0]
["Estonia",0.20122148561647768,0.57800713515032764,5.1142516284744616E-2,0.15896743893662763,1.0661424011822608E-2]
["FYR Macedonia",0,0,0,0,0]
["Georgia",0.20831634622415346,0.67514304429681171,8.6716597738239184E-2,2.2027335449968724E-2,7.7966762908268303E-3]
["Germany",0.7292765671140955,0.22488118555246864,7.9622542737354217E-3,3.7879993059700572E-2,0]
["Greece",0.13145766921190249,0.73080643628047648,6.8733229949047805E-2,5.493362951627398E-2,1.4069035042299578E-2]
["Hungary",0.26571948654389688,0.52522833697387328,0.12018213171880715,6.3340078182883022E-2,2.5529966580539753E-2]
["Italy",0.1012381456937954,0.76689232393193052,3.946459845124875E-2,6.3660126731037409E-2,2.8744805191987962E-2]
["Kazakhstan",0.14361285733218751,0.60182768745851412,0.15895853504990043,9.5600920159397973E-2,0]
["Kosovo",9.5380654789162092E-2,0.72869864696372622,0.17155333132829298,1.5968095012332153E-3,2.7705574175850897E-3]
["Kyrgyz Rep.",0.21261532484790802,0.6192178934396555,0.13272250966217169,2.6597380525520936E-2,8.846891524743784E-3]
["Latvia",0.21282977765322075,0.54169602717295906,0.17503095021583437,7.0443244957986151E-2,0]
["Lithuania",9.0629289625548323E-2,0.61514395447526593,0.13155412417123302,0.16267263172795199,0]
["Moldova",0,0,0,0,0]
["Mongolia",0.12125267395329226,0.59920100247439323,0.22072339128436705,5.1890011885319672E-2,6.9329204026285559E-3]
["Montenegro",0.240916957839033,0.58265219634015264,0.14688516120822476,2.9545684612589572E-2,0]
["Poland",0.6751843256567992,0.1962747463980003,1.050202832248847E-2,6.6160141242310511E-2,5.1878758380401777E-2]
["Romania",9.5990289215425934E-2,0.7278667638035714,0.10475886298307251,4.7268995389893577E-2,2.4115088608036336E-2]
["Russia",0.11339063175293287,0.47193334266581644,0.15129949298068301,0.24497165891351547,1.8404873687051907E-2]
["Serbia",0.14462826934329948,0.65183254512320132,0.14647266689565058,5.0918247966459031E-2,6.1482706713892775E-3]
["Slovak Rep.",9.4022941506685595E-2,0.76950634592372513,0.10101016434356642,3.3024158867779159E-2,2.4363893582438662E-3]
["Slovenia",0.24894326030916253,0.653487809843742,9.400626947984872E-2,0,3.5626603672466077E-3]
["Tajikistan",2.5644721408049284E-2,0.86012984382700575,9.8718572673459251E-2,2.277470073608259E-3,1.3229392017876587E-2]
["Turkey",0.64679192822035159,0.31037418794285265,2.8943159292979578E-2,1.3890724543817045E-2,0]
["Ukraine",0,0,0,0,0]

{"sheet":"Q3","index":6,"n_rows":275,"n_cols":17,"rows_kept":275,"cut":false,"hidden":true,"merged":[[178,8,178,9],[251,8,251,9]]}
["QUESTION 3"]
[]
["Input for pivot table"]
[null,"People don’t have enough time to report it","People don’t know where to report it","People don’t know how to report it","Nothing will be done / It wouldn’t make a difference","It’s too expensive to report (e.g. due to travel or phone charges)","Corruption is normal / Everyone does it / everyone is involved","People are afraid of the consequences","The officials where they would report to are also corrupt / officials are involved in the corruption","It’s government’s money, not the people’s, so it’s not our problem","Corruption is hidden/ it’s difficult to prove","Because they would implicate themselves as bribe-givers","Most people do report incidents of corruption","Other ","Don’t know","Refusal","ADD NEW LABEL"]
["Country",1,2,3,4,5,6,7,8,9,10,11,12,13,14,15,16]
["Albania",0.05,0.08,0.08,0.15,0,0.03,0.13,0.11,0.01,0.12,0.1,0.06,0,0.06,0.03]
["Armenia",0,0.02,0.02,0.23,0,0.04,0.41,0.05,0,0.03,0.05,0,0.02,0.13,0]
["Azerbaijan",0.03,0.02,0.02,0.03,0,0,0.14000000000000001,0.01,0,0.12,0.14000000000000001,0.04,0.02,0.42,0.01]
["Belarus",0.05,0.06,0.04,0.15,0.03,0.03,0.2,0.08,0.02,0.09,0.14000000000000001,0.04,0.01,0.04,0.01]
["Bosnia and Herz.",0.02,0.04,0.05,0.2,0.01,0.01,0.33,0.05,0,0.17,0.04,0.01,0.01,0.06,0.02]
["Bulgaria",0.01,0.03,0.04,0.17,0,0.02,0.28999999999999998,0.04,0,0.22,0.06,0.02,0,0.08,0.01]
["Croatia",0.03,0.04,0.05,0.15,0,0.02,0.28999999999999998,0.04,0.01,0.24,0.05,0.01,0,0.05,0.02]
["Cyprus",0.01,0.02,0.01,0.16,0,0.03,0.4,0.02,0,0.19,0.08,0.05,0,0.03,0]
["Czech Rep.",0.02,0.05,0.05,0.14000000000000001,0,0.01,0.28999999999999998,0.02,0.01,0.27,7.0000000000000007E-2,0.02,0.01,0.03,0.01]
["Estonia",0.03,0.02,0.03,0.11,0,0.01,0.28999999999999998,0.01,0.02,0.15,0.12,0.02,0.03,0.15,0]
["Georgia",0.02,0.04,0.01,7.0000000000000007E-2,0,0.01,0.28999999999999998,0.02,0.01,0.14000000000000001,0.05,0.04,0.01,0.28000000000000003,0.02]
["Germany",0.01,0.08,7.0000000000000007E-2,7.0000000000000007E-2,0.01,0,0.19,0.01,0,0.24,0.05,0.12,0.01,0.14000000000000001,0]
["Greece",0.02,0.06,7.0000000000000007E-2,0.18,0.01,0.05,0.27,0.03,0,0.19,0.08,0.02,0,0.02,0]
["Hungary",0.03,0.05,0.05,0.2,0.01,0.02,0.23,0.02,0.01,0.24,0.02,0.01,0,0.08,0.03]
["Italy",0.03,7.0000000000000007E-2,0,0.16,0,0.03,0.28000000000000003,0.05,0.01,0.2,0.04,0.08,0.01,0.03,0.01]
["Kazakhstan",0.04,0.03,0.03,0.13,0.01,0.02,0.26,0.03,0.01,0.14000000000000001,0.14000000000000001,7.0000000000000007E-2,0,0.06,0.02]
["Kosovo",0.01,0.08,0.05,0.11,0,0,0.31,7.0000000000000007E-2,0,0.09,0.05,0.03,0,0.16,0.05]
["Kyrgyz Rep.",0.05,7.0000000000000007E-2,0.05,0.11,0.03,0.08,0.1,0.12,0,0.14000000000000001,0.12,7.0000000000000007E-2,0.01,0.04,0.01]
["Latvia",0.02,0.02,0.01,0.14000000000000001,0,0.04,0.34,0.04,0.01,0.12,0.09,0.01,0.05,0.1,0.01]
["Lithuania",0.02,0.03,0.02,0.14000000000000001,0,0.03,0.39,0.01,0.01,0.21,7.0000000000000007E-2,0.01,0.01,0.05,0]
["Mongolia",0.03,0.08,0.06,0.09,0.01,0.05,0.22,7.0000000000000007E-2,0.03,0.2,0.11,0.02,0,0.04,0]
["Montenegro",0.01,0.03,0.03,0.1,0,0.01,0.33,0.02,0.01,0.19,0.05,0.02,0,0.15,0.05]
["Poland",0.06,7.0000000000000007E-2,7.0000000000000007E-2,0.08,0,0.02,0.26,0.02,0,0.14000000000000001,0.09,0.02,0,0.17,0.01]
["Romania",0.05,0.08,0.05,0.14000000000000001,0.02,0.01,0.36,0.03,0,0.1,0.03,0.01,0,0.11,0.01]
["Russia",0.08,0.06,0.08,0.16,0.01,0.02,0.17,0.09,0.01,0.14000000000000001,0.11,0.01,0,0.05,0.01]
["Serbia",0.06,0.09,0.09,0.1,0.01,0.02,0.24,0.02,0,0.17,0.06,0.04,0,0.08,0.01]
["Slovak Rep.",0.02,0.05,7.0000000000000007E-2,0.22,0.01,0.02,0.27,0.02,0,0.19,7.0000000000000007E-2,0.02,0,0.06,0.01]
["Slovenia",0.01,0.02,0.02,0.11,0,0.04,0.36,0.02,0,0.15,0.14000000000000001,0.01,0.02,0.1,0.02]
["Tajikistan",0.05,7.0000000000000007E-2,0.06,0.05,0.01,0.03,0.18,0.05,0.01,0.2,7.0000000000000007E-2,0.09,0,0.11,0.02]
["Turkey",0.05,0.08,0.05,7.0000000000000007E-2,0,0.02,0.19,0.09,0.01,0.14000000000000001,0.08,0.03,0,0.14000000000000001,0.04]
[]
["PT1"]
["Country","Montenegro"]
[]
["Values"]
["Sum of 7",0.33]
["Sum of 6",0.01]
["Sum of 4",0.1]
["Sum of 8",0.02]
["Sum of 10",0.19]
["Sum of 3",0.03]
["Sum of 5",0]
["Sum of 9",0.01]
["Sum of 1",0.01]
["Sum of 2",0.03]
["Sum of 11",0.05]
["Sum of 12",0.02]
[]
[null,"LABELS",null,null,null,null,"Ranking","Ranking2","Extrac pivot table values",null,null,"ORDER",null,"This is what is added into the methodology note"]
["Sum of 1","People don’t have enough time to report it",null,null,null,null,{"$f":"+RANK(J55,$J$55:$J$66,0)","v":1},{"$f":"SUM(1*(J55<$J$55:$J$66))+1+IF(ROW(J55)-ROW($J$55)=0,0,SUM(1*(J55=OFFSET($J$55,0,0,INDEX(ROW(J55)-ROW($J$55)+1,1)-1,1))))","v":1},{"$f":"A41","v":"Sum of 7"},{"$f":"B41","v":0.33},null,1,{"$f":"+VLOOKUP(L55,$H$55:$I$66,2,FALSE)","v":"Sum of 7"},{"$f":"+VLOOKUP(M55,$I$55:$J$66,2,FALSE)","v":0.33},{"$f":"+VLOOKUP(M55,$A$55:$B$66,2,FALSE)","v":"People are afraid of the consequences"}]
["Sum of 2","People don’t know where to report it",null,null,null,null,9,{"$f":"SUM(1*(J56<$J$55:$J$66))+1+IF(ROW(J56)-ROW($J$55)=0,0,SUM(1*(J56=OFFSET($J$55,0,0,INDEX(ROW(J56)-ROW($J$55)+1,1)-1,1))))","v":9},"Sum of 6",0.01,null,2,"Sum of 10",0.19,"Corruption is hidden/ it’s difficult to prove"]
["Sum of 3","People don’t know how to report it",null,null,null,null,3,{"$f":"SUM(1*(J57<$J$55:$J$66))+1+IF(ROW(J57)-ROW($J$55)=0,0,SUM(1*(J57=OFFSET($J$55,0,0,INDEX(ROW(J57)-ROW($J$55)+1,1)-1,1))))","v":3},"Sum of 4",0.1,null,3,"Sum of 4",0.1,"Nothing will be done / It wouldn’t make a difference"]
["Sum of 4","Nothing will be done / It wouldn’t make a difference",null,null,null,null,7,{"$f":"SUM(1*(J58<$J$55:$J$66))+1+IF(ROW(J58)-ROW($J$55)=0,0,SUM(1*(J58=OFFSET($J$55,0,0,INDEX(ROW(J58)-ROW($J$55)+1,1)-1,1))))","v":7},"Sum of 8",0.02,null,4,"Sum of 11",0.05,"Because they would implicate themselves as bribe-givers"]
["Sum of 5","It’s too expensive to report (e.g. due to travel or phone charges)",null,null,null,null,2,{"$f":"SUM(1*(J59<$J$55:$J$66))+1+IF(ROW(J59)-ROW($J$55)=0,0,SUM(1*(J59=OFFSET($J$55,0,0,INDEX(ROW(J59)-ROW($J$55)+1,1)-1,1))))","v":2},"Sum of 10",0.19,null,5,"Sum of 3",0.03,"People don’t know how to report it"]
["Sum of 6","Corruption is normal / Everyone does it / everyone is involved",null,null,null,null,5,{"$f":"SUM(1*(J60<$J$55:$J$66))+1+IF(ROW(J60)-ROW($J$55)=0,0,SUM(1*(J60=OFFSET($J$55,0,0,INDEX(ROW(J60)-ROW($J$55)+1,1)-1,1))))","v":5},"Sum of 3",0.03,null,6,"Sum of 2",0.03,"People don’t know where to report it"]
["Sum of 7","People are afraid of the consequences",null,null,null,null,12,{"$f":"SUM(1*(J61<$J$55:$J$66))+1+IF(ROW(J61)-ROW($J$55)=0,0,SUM(1*(J61=OFFSET($J$55,0,0,INDEX(ROW(J61)-ROW($J$55)+1,1)-1,1))))","v":12},"Sum of 5",0,null,7,"Sum of 8",0.02,{"$f":"+VLOOKUP(M61,$A$55:$B$67,2,FALSE)","v":"The officials where they would report to are also corrupt / officials are involved in the corruption"}]
["Sum of 8","The officials where they would report to are also corrupt / officials are involved in the corruption",null,null,null,null,9,{"$f":"SUM(1*(J62<$J$55:$J$66))+1+IF(ROW(J62)-ROW($J$55)=0,0,SUM(1*(J62=OFFSET($J$55,0,0,INDEX(ROW(J62)-ROW($J$55)+1,1)-1,1))))","v":10},"Sum of 9",0.01,null,8,"Sum of 12",0.02,{"$f":"+VLOOKUP(M62,$A$55:$B$66,2,FALSE)","v":"Most people do report incidents of corruption"}]
["Sum of 9","It’s government’s money, not the people’s, so it’s not our problem",null,null,null,null,9,{"$f":"SUM(1*(J63<$J$55:$J$66))+1+IF(ROW(J63)-ROW($J$55)=0,0,SUM(1*(J63=OFFSET($J$55,0,0,INDEX(ROW(J63)-ROW($J$55)+1,1)-1,1))))","v":11},"Sum of 1",0.01,null,9,"Sum of 6",0.01,{"$f":"+VLOOKUP(M63,$A$55:$B$67,2,FALSE)","v":"Corruption is normal / Everyone does it / everyone is involved"}]
["Sum of 10","Corruption is hidden/ it’s difficult to prove",null,null,null,null,5,{"$f":"SUM(1*(J64<$J$55:$J$66))+1+IF(ROW(J64)-ROW($J$55)=0,0,SUM(1*(J64=OFFSET($J$55,0,0,INDEX(ROW(J64)-ROW($J$55)+1,1)-1,1))))","v":6},"Sum of 2",0.03,null,10,"Sum of 9",0.01,{"$f":"+VLOOKUP(M64,$A$55:$B$66,2,FALSE)","v":"It’s government’s money, not the people’s, so it’s not our problem"}]
["Sum of 11","Because they would implicate themselves as bribe-givers",null,null,null,null,4,{"$f":"SUM(1*(J65<$J$55:$J$66))+1+IF(ROW(J65)-ROW($J$55)=0,0,SUM(1*(J65=OFFSET($J$55,0,0,INDEX(ROW(J65)-ROW($J$55)+1,1)-1,1))))","v":4},"Sum of 11",0.05,null,11,"Sum of 1",0.01,{"$f":"+VLOOKUP(M65,$A$55:$B$66,2,FALSE)","v":"People don’t have enough time to report it"}]
["Sum of 12","Most people do report incidents of corruption",null,null,null,null,7,{"$f":"SUM(1*(J66<$J$55:$J$66))+1+IF(ROW(J66)-ROW($J$55)=0,0,SUM(1*(J66=OFFSET($J$55,0,0,INDEX(ROW(J66)-ROW($J$55)+1,1)-1,1))))","v":8},"Sum of 12",0.02,null,12,"Sum of 5",0,{"$f":"+VLOOKUP(M66,$A$55:$B$66,2,FALSE)","v":"It’s too expensive to report (e.g. due to travel or phone charges)"}]
["Sum of 13","Other"]
["Sum of 14","Don't know "," "]
[null,"NEW LABEL",null,null,null,null,null,null,null,null,null,null,null,"DO NOT CHANGE this will change automatically (first change green table or reflesh pivot or change label names depending on what you need)"]
[]
[]
[]
["QUESTION 7"]
["Input for pivot table"]
[null,"Refuse to pay bribes","Report corruption when you see or experience it","Vote for clean candidates or parties or for parties that promise to fight corruption","Speak out about the problem, for example, by calling a radio program or writing a letter, or on social media","Talk to friends and relatives about the problem","Sign a petition asking for a stronger fight against corruption","Join or support an organization that is fighting corruption","Participate in protest marches or demonstrations against corruption","Boycott a business which has been found guilty of engaging in corruption","Nothing / Ordinary people cannot do anything","Other [specify]","Don’t know","Not applicable","ADD NEW"]
["Country",1,2,3,4,5,6,7,8,9,10,11,12,13,14]
["Albania",0.3,0.19,0.05,0.06,0.03,0.04,7.0000000000000007E-2,0.02,0.01,0.19,0,0.04,0]
["Armenia",0.21,0.03,0,0.01,0.01,0,0.01,0.02,0,0.52,0.03,0.14000000000000001,0]
["Azerbaijan",0.17,7.0000000000000007E-2,0.04,0.03,0.02,0.01,0.01,0.01,0,0.23,0.02,0.38,0.01]
["Belarus",0.25,0.06,0.08,0.03,0.02,0.01,0.01,0,0.01,0.5,0,0.02,0]
["Bosnia and Herz.",0.23,0.1,0.04,0.06,0.02,0.03,0.01,0.02,0.03,0.35,0.01,0.08,0]
["Bulgaria",0.25,0.1,0.03,0.05,0.02,0.01,0.02,0.02,0.01,0.37,0,0.09,0.01]
["Croatia",0.25,0.17,0.05,0.04,0.02,0.03,0.02,0.01,0.01,0.32,0,0.06,0]
["Cyprus",0.13,0.27,0.06,0.08,7.0000000000000007E-2,0.01,0.02,0.03,0.02,0.26,0,0.04,0]
["Czech Rep.",0.34,0.11,0.06,0.02,0.03,0.01,0.01,0,0.02,0.32,0,7.0000000000000007E-2,0]
["Estonia",0.3,0.15,0.04,0.05,0.02,0,0.01,0,0.01,0.26,0.02,0.13,0]
["Georgia",0.16,0.11,0.06,0.03,0,0.02,0.02,0,0.01,0.3,0.02,0.24,0]
["Germany",0.1,0.41,7.0000000000000007E-2,0.05,0.04,0.01,0.02,0.02,0.04,0.1,0,0.13,0]
["Greece",0.32,0.32,0.05,0.06,0.03,0.01,0.02,0.01,0.01,0.15,0,0.02,0]
["Hungary",0.1,7.0000000000000007E-2,0.05,0.06,7.0000000000000007E-2,0.02,0.01,0.01,0.02,0.46,0,0.09,0.01]
["Italy",0.21,0.23,7.0000000000000007E-2,0.04,0.02,0.02,0.08,0.02,0.03,0.23,0.01,0.04,0]
["Kazakhstan",0.24,0.08,0.05,0.06,0.01,0,0.02,0,0.01,0.43,0,7.0000000000000007E-2,0]
["Kosovo",0.18,0.17,0.05,0.05,0.02,0.04,0.06,0.04,0.01,0.19,0,0.14000000000000001,0.01]
["Kyrgyz Rep.",0.2,0.1,0.1,0.05,0.02,0.01,0.02,0.01,0.03,0.42,0,0.02,0]
["Latvia",0.28999999999999998,0.17,0.02,0.03,0.01,0.01,0.02,0.01,0,0.28000000000000003,0.05,0.09,0.01]
["Lithuania",0.34,0.15,0.03,0.02,0.01,0.01,0.01,0.01,0.01,0.31,0.02,7.0000000000000007E-2,0]
["Mongolia",0.49,0.14000000000000001,0.02,0.02,0.01,0.01,0.02,0.01,0.01,0.24,0,0.03,0]
["Montenegro",0.18,0.2,0.03,0.04,0.04,0.03,0.04,0.01,0.01,0.25,0,0.11,0.01]
["Poland",0.33,0.11,0.08,0.06,0.02,0.01,0.01,0.01,0.04,0.18,0,0.15,0]
["Romania",0.27,0.12,0.05,0.03,0.04,0.02,0.02,0.05,0,0.24,0,0.14000000000000001,0]
["Russia",0.25,0.09,0.05,0.06,0.02,0.02,0.03,0.01,0.04,0.33,0,0.08,0.01]
["Serbia",0.16,0.15,0.08,0.06,0.06,0.03,0.02,0,0.01,0.28999999999999998,0,0.11,0.01]
["Slovak Rep.",0.28000000000000003,7.0000000000000007E-2,0.02,0.02,0.05,0.02,0.01,0.01,0.02,0.41,0,0.08,0]
["Slovenia",0.15,0.2,0.01,0.02,0.01,0.01,0.02,0.01,0.01,0.36,0.03,0.13,0]
["Tajikistan",0.31,0.1,7.0000000000000007E-2,0.04,0.03,0.01,0.04,0,0,0.27,0,0.1,0.01]
["Turkey",0.18,0.15,0.15,0.05,0.03,0.04,0.06,0.06,0.04,7.0000000000000007E-2,0,0.13,0.02]
[]
["Pivot table:"]
["PT2"]
["Country","Montenegro"]
[null,null,null,null,null,null,"Ranking","Ranking2","Extrac pivot table values",null,null,"ORDER",null,"This is what is added into the country data sheet"]
["Values",null,null,null,null,null,{"$f":"+RANK(J112,$J$112:$J$121,0)","v":3},{"$f":"SUM(1*(J112<$J$112:$J$121))+1+IF(ROW(J112)-ROW($J$112)=0,0,SUM(1*(J112=OFFSET($J$112,0,0,INDEX(ROW(J112)-ROW($J$112)+1,1)-1,1))))","v":3},{"$f":"+A113","v":"Sum of 1"},{"$f":"+B113","v":0.18},null,1,{"$f":"+VLOOKUP(L112,$H$112:$I$121,2,FALSE)","v":"Sum of 10"},{"$f":"+VLOOKUP(M112,$I$112:$J$121,2,FALSE)","v":0.25},{"$f":"+VLOOKUP(M112,$A$125:$B$134,2,FALSE)","v":"Ordinary people cannot do anything "}]
["Sum of 1",0.18,null,null,null,null,2,{"$f":"SUM(1*(J113<$J$112:$J$121))+1+IF(ROW(J113)-ROW($J$112)=0,0,SUM(1*(J113=OFFSET($J$112,0,0,INDEX(ROW(J113)-ROW($J$112)+1,1)-1,1))))","v":2},{"$f":"+A114","v":"Sum of 2"},{"$f":"+B114","v":0.2},null,2,{"$f":"+VLOOKUP(L113,$H$112:$I$121,2,FALSE)","v":"Sum of 2"},{"$f":"+VLOOKUP(M113,$I$112:$J$121,2,FALSE)","v":0.2},{"$f":"+VLOOKUP(M113,$A$125:$B$134,2,FALSE)","v":"Report corruption when you see or experience it"}]
["Sum of 2",0.2,null,null,null,null,7,{"$f":"SUM(1*(J114<$J$112:$J$121))+1+IF(ROW(J114)-ROW($J$112)=0,0,SUM(1*(J114=OFFSET($J$112,0,0,INDEX(ROW(J114)-ROW($J$112)+1,1)-1,1))))","v":7},"Sum of 3",{"$f":"+B115","v":0.03},null,3,"Sum of 1",0.18,"Refuse to pay bribes"]
["Sum of 3",0.03,null,null,null,null,4,{"$f":"SUM(1*(J115<$J$112:$J$121))+1+IF(ROW(J115)-ROW($J$112)=0,0,SUM(1*(J115=OFFSET($J$112,0,0,INDEX(ROW(J115)-ROW($J$112)+1,1)-1,1))))","v":4},"Sum of 4",{"$f":"+B116","v":0.04},null,4,"Sum of 4",0.04,"Speak out about the problem"]
["Sum of 4",0.04,null,null,null,null,4,{"$f":"SUM(1*(J116<$J$112:$J$121))+1+IF(ROW(J116)-ROW($J$112)=0,0,SUM(1*(J116=OFFSET($J$112,0,0,INDEX(ROW(J116)-ROW($J$112)+1,1)-1,1))))","v":5},"Sum of 5",0.04,null,5,"Sum of 5",0.04,"Talk to friends and relatives "]
["Sum of 5",0.04,null,null,null,null,7,{"$f":"SUM(1*(J117<$J$112:$J$121))+1+IF(ROW(J117)-ROW($J$112)=0,0,SUM(1*(J117=OFFSET($J$112,0,0,INDEX(ROW(J117)-ROW($J$112)+1,1)-1,1))))","v":8},"Sum of 6",{"$f":"+B118","v":0.03},null,6,"Sum of 7",0.04,"Join or support an anti-corruption organization"]
["Sum of 6",0.03,null,null,null,null,4,{"$f":"SUM(1*(J118<$J$112:$J$121))+1+IF(ROW(J118)-ROW($J$112)=0,0,SUM(1*(J118=OFFSET($J$112,0,0,INDEX(ROW(J118)-ROW($J$112)+1,1)-1,1))))","v":6},"Sum of 7",{"$f":"+B119","v":0.04},null,7,"Sum of 3",0.03,"Vote for clean candidates or parties"]
["Sum of 7",0.04,null,null,null,null,9,{"$f":"SUM(1*(J119<$J$112:$J$121))+1+IF(ROW(J119)-ROW($J$112)=0,0,SUM(1*(J119=OFFSET($J$112,0,0,INDEX(ROW(J119)-ROW($J$112)+1,1)-1,1))))","v":9},"Sum of 8",0.01,null,8,"Sum of 6",0.03,"Sign a petition"]
["Sum of 8",0.01,null,null,null,null,9,{"$f":"SUM(1*(J120<$J$112:$J$121))+1+IF(ROW(J120)-ROW($J$112)=0,0,SUM(1*(J120=OFFSET($J$112,0,0,INDEX(ROW(J120)-ROW($J$112)+1,1)-1,1))))","v":10},"Sum of 9",{"$f":"+B121","v":0.01},null,9,"Sum of 8",0.01,"Participate in protest marches or demonstrations"]
["Sum of 9",0.01,null,null,null,null,1,{"$f":"SUM(1*(J121<$J$112:$J$121))+1+IF(ROW(J121)-ROW($J$112)=0,0,SUM(1*(J121=OFFSET($J$112,0,0,INDEX(ROW(J121)-ROW($J$112)+1,1)-1,1))))","v":1},"Sum of 10",0.25,null,10,"Sum of 9",0.01,"Boycott a corrupt business"]
["Sum of 10",0.25]
[]
[null,"LABELS"]
["Sum of 1","Refuse to pay bribes"]
["Sum of 2","Report corruption when you see or experience it"]
["Sum of 3","Vote for clean candidates or parties"]
["Sum of 4","Speak out about the problem"]
["Sum of 5","Talk to friends and relatives "]
["Sum of 6","Sign a petition"]
["Sum of 7","Join or support an anti-corruption organization"]
["Sum of 8","Participate in protest marches or demonstrations"]
["Sum of 9","Boycott a corrupt business"]
["Sum of 10","Ordinary people cannot do anything "]
["Sum of 11","Other"]
["Sum of 12","Don't know"]
["Sum of 13","Not applicable"]
[null,"NEW LABEL"]
[]
[]
[]
["QUESTION 4"]
[null,"Health","Crime","The economy","Education","Environment","Corruption/ bribery","Immigration ","Political instability/ security","Unemployment","Infrastructure, transportation, roads","Other","ADD NEW"]
["Country",1,2,3,4,5,6,7,8,9,10,11,12]
["Albania",0.54,0.36,0.53,0.21,0.05,0.34,0.08,0.04,0.54,7.0000000000000007E-2,0]
["Armenia",0.57999999999999996,0.16,0.27,0.24,0.02,0.37,0.32,0.15,0.64,0.04,0.01]
["Azerbaijan",0.08,0.09,0.08,0.21,0.03,0.21,0.01,0.05,0.59,0.02,0.68]
["Belarus",0.69,0.31,0.84,0.23,0.14000000000000001,0.14000000000000001,0.02,0.11,0.41,0.05,0]
["Bosnia and Herz.",0.2,0.61,0.34,0.12,0.02,0.55000000000000004,0.05,0.27,0.63,0.05,0]
["Bulgaria",0.63,0.38,0.5,0.2,0.03,0.36,0.15,0.11,0.39,0.06,0.01]
["Croatia",0.25,0.4,0.47,0.14000000000000001,0.02,0.51,0.13,0.15,0.66,0.05,0.01]
["Cyprus",0.49,0.15,0.63,0.19,0.02,0.49,0.12,0.14000000000000001,0.62,0.01,0.05]
["Czech Rep.",0.32,0.37,0.28000000000000003,0.19,0.15,0.41,0.45,0.15,0.24,0.08,0]
["Estonia",0.59,0.16,0.47,0.28999999999999998,7.0000000000000007E-2,0.25,0.25,0.23,0.44,0.06,0.01]
["Georgia",0.78,0.18,0.56000000000000005,0.3,0.04,0.12,0.05,0.14000000000000001,0.76,0.05,0]
["Germany",0.39,0.28999999999999998,0.39,0.42,0.31,0.02,0.69,0.27,0.17,0.02,0.01]
["Greece",0.44,0.05,0.74,0.2,0.02,0.24,0.36,0.14000000000000001,0.71,0,0.02]
["Hungary",0.67,0.28999999999999998,0.3,0.19,0.09,0.28000000000000003,0.28999999999999998,0.04,0.46,0.08,0]
["Italy",0.35,0.22,0.35,0.15,0.05,0.28000000000000003,0.48,0.22,0.64,0.09,0.01]
["Kazakhstan",0.67,0.31,0.49,0.3,0.1,0.37,0.01,0.1,0.43,0.16,0]
["Kosovo",0.41,0.25,0.37,0.14000000000000001,0.02,0.65,0.04,0.15,0.7,0.02,0.01]
["Kyrgyz Rep.",0.67,0.28999999999999998,0.52,0.35,0.08,0.47,0.05,0.09,0.39,0.09,0]
["Latvia",0.66,0.12,0.46,0.28000000000000003,0.02,0.35,0.16,0.22,0.37,0.18,0.01]
["Lithuania",0.32,0.28999999999999998,0.43,0.19,0.02,0.54,0.22,0.18,0.6,0.03,0.02]
["Mongolia",0.66,0.15,0.46,0.39,0.11,0.27,0.02,0.27,0.46,0.11,0]
["Montenegro",0.41,0.42,0.31,0.2,0.08,0.31,0.01,0.08,0.68,7.0000000000000007E-2,0.01]
["Poland",0.81,0.22,0.23,0.2,0.09,0.15,0.28000000000000003,0.16,0.46,0.18,0.01]
["Romania",0.71,0.13,0.4,0.47,0.06,0.49,7.0000000000000007E-2,7.0000000000000007E-2,0.18,0.21,0.01]
["Russia",0.56000000000000005,0.23,0.61,0.26,0.08,0.39,0.06,0.14000000000000001,0.26,0.15,0.01]
["Serbia",0.25,0.38,0.5,0.14000000000000001,0.05,0.39,0.13,0.2,0.52,0.08,0]
["Slovak Rep.",0.63,0.13,0.34,0.25,0.13,0.38,0.21,0.1,0.48,0.1,0.01]
["Slovenia",0.21,0.28999999999999998,0.44,0.08,0.05,0.59,0.25,0.24,0.45,7.0000000000000007E-2,0.02]
["Tajikistan",0.46,0.21,0.5,0.37,0.08,0.18,0.42,0.05,0.56000000000000005,0.05,0.02]
["Turkey",0.51,0.35,0.57999999999999996,0.4,0.05,0.22,0.11,0.16,0.28000000000000003,7.0000000000000007E-2,0.01]
[]
["Pivot table:"]
["PT3"]
["Country","Montenegro"]
[null,null,null,null,null,null,"Ranking","Ranking2","Extrac pivot table values",null,null,"ORDER",null,"This is what is added into the methodology note"]
["Values",null,null,null,null,null,{"$f":"+RANK(J180,$J$180:$J$189,0)","v":3},{"$f":"SUM(1*(J180<$J$180:$J$189))+1+IF(ROW(J180)-ROW($J$180)=0,0,SUM(1*(J180=OFFSET($J$180,0,0,INDEX(ROW(J180)-ROW($J$180)+1,1)-1,1))))","v":3},{"$f":"A181","v":"Sum of 1"},{"$f":"B181","v":0.41},null,1,{"$f":"+VLOOKUP(L180,$H$180:$I$189,2,FALSE)","v":"Sum of 9"},{"$f":"+VLOOKUP(M180,$I$180:$J$189,2,FALSE)","v":0.68},{"$f":"+VLOOKUP(M180,$A$194:$B$204,2,FALSE)","v":"Unemployment"}]
["Sum of 1",0.41,null,null,null,null,{"$f":"+RANK(J181,$J$180:$J$189,0)","v":2},{"$f":"SUM(1*(J181<$J$180:$J$189))+1+IF(ROW(J181)-ROW($J$180)=0,0,SUM(1*(J181=OFFSET($J$180,0,0,INDEX(ROW(J181)-ROW($J$180)+1,1)-1,1))))","v":2},{"$f":"A182","v":"Sum of 2"},{"$f":"B182","v":0.42},null,2,{"$f":"+VLOOKUP(L181,$H$180:$I$189,2,FALSE)","v":"Sum of 2"},{"$f":"+VLOOKUP(M181,$I$180:$J$189,2,FALSE)","v":0.42},"Crime"]
["Sum of 2",0.42,null,null,null,null,4,{"$f":"SUM(1*(J182<$J$180:$J$189))+1+IF(ROW(J182)-ROW($J$180)=0,0,SUM(1*(J182=OFFSET($J$180,0,0,INDEX(ROW(J182)-ROW($J$180)+1,1)-1,1))))","v":4},"Sum of 3",0.31,null,3,"Sum of 1",{"$f":"+VLOOKUP(M182,$I$180:$J$189,2,FALSE)","v":0.41},"Health"]
["Sum of 3",0.31,null,null,null,null,6,{"$f":"SUM(1*(J183<$J$180:$J$189))+1+IF(ROW(J183)-ROW($J$180)=0,0,SUM(1*(J183=OFFSET($J$180,0,0,INDEX(ROW(J183)-ROW($J$180)+1,1)-1,1))))","v":6},"Sum of 4",0.2,null,4,{"$f":"+VLOOKUP(L183,$H$180:$I$189,2,FALSE)","v":"Sum of 3"},0.31,"The economy"]
["Sum of 4",0.2,null,null,null,null,7,{"$f":"SUM(1*(J184<$J$180:$J$189))+1+IF(ROW(J184)-ROW($J$180)=0,0,SUM(1*(J184=OFFSET($J$180,0,0,INDEX(ROW(J184)-ROW($J$180)+1,1)-1,1))))","v":7},"Sum of 5",0.08,null,5,"Sum of 6",0.31,"Corruption/Bribery"]
["Sum of 5",0.08,null,null,null,null,4,{"$f":"SUM(1*(J185<$J$180:$J$189))+1+IF(ROW(J185)-ROW($J$180)=0,0,SUM(1*(J185=OFFSET($J$180,0,0,INDEX(ROW(J185)-ROW($J$180)+1,1)-1,1))))","v":5},"Sum of 6",0.31,null,6,"Sum of 4",0.2,"Education"]
["Sum of 6",0.31,null,null,null,null,10,{"$f":"SUM(1*(J186<$J$180:$J$189))+1+IF(ROW(J186)-ROW($J$180)=0,0,SUM(1*(J186=OFFSET($J$180,0,0,INDEX(ROW(J186)-ROW($J$180)+1,1)-1,1))))","v":10},"Sum of 7",0.01,null,7,"Sum of 5",0.08,"Environment"]
["Sum of 7",0.01,null,null,null,null,7,{"$f":"SUM(1*(J187<$J$180:$J$189))+1+IF(ROW(J187)-ROW($J$180)=0,0,SUM(1*(J187=OFFSET($J$180,0,0,INDEX(ROW(J187)-ROW($J$180)+1,1)-1,1))))","v":8},"Sum of 8",0.08,null,8,"Sum of 8",0.08,"Political instability/Security"]
["Sum of 8",0.08,null,null,null,null,1,{"$f":"SUM(1*(J188<$J$180:$J$189))+1+IF(ROW(J188)-ROW($J$180)=0,0,SUM(1*(J188=OFFSET($J$180,0,0,INDEX(ROW(J188)-ROW($J$180)+1,1)-1,1))))","v":1},{"$f":"A189","v":"Sum of 9"},{"$f":"B189","v":0.68},null,9,"Sum of 10",7.0000000000000007E-2,"Infrastructure"]
["Sum of 9",0.68,null,null,null,null,9,{"$f":"SUM(1*(J189<$J$180:$J$189))+1+IF(ROW(J189)-ROW($J$180)=0,0,SUM(1*(J189=OFFSET($J$180,0,0,INDEX(ROW(J189)-ROW($J$180)+1,1)-1,1))))","v":9},{"$f":"A190","v":"Sum of 10"},7.0000000000000007E-2,null,10,"Sum of 7",0.01,"Immigration"]
["Sum of 10",7.0000000000000007E-2]
["Sum of 11",0.01]
[]
[null,"LABELS"]
["Sum of 1","Health"]
["Sum of 2","Crime"]
["Sum of 3","The economy"]
["Sum of 4","Education"]
["Sum of 5","Environment"]
["Sum of 6","Corruption/Bribery"]
["Sum of 7","Immigration"]
["Sum of 8","Political instability/Security"]
["Sum of 9","Unemployment"]
["Sum of 10","Infrastructure"]
["Sum of 11 ","Other"]
[]
[]
[]
[null,"NEW LABEL"]
[]
[]
["QUESTION 1"]
[null,"President/Prime Minister and officials in his office","Members of the parliament","Government officials","Local government representatives","Tax officials","Police","Judges and magistrates","Business executives","Religious leaders","ADD NEW"]
["Country",1,2,3,4,5,6,7,8,9,10]
["Albania",0.36,0.55000000000000004,0.45,0.42,0.43,0.36,0.56000000000000005,0.38,0.27]
["Armenia",0.44,0.42,0.45,0.37,0.43,0.4,0.41,0.31,0.28999999999999998]
["Azerbaijan",0.09,0.12,0.12,0.14000000000000001,0.18,0.21,0.16,0.1,0.08]
["Belarus",0.18,0.22,0.32,0.32,0.3,0.34,0.23,0.32,0.19]
["Bosnia and Herz.",0.53,0.54,0.56000000000000005,0.52,0.52,0.41,0.44,0.48,0.31]
["Bulgaria",0.2,0.41,0.31,0.28999999999999998,0.32,0.31,0.42,0.2,0.18]
["Croatia",0.17,0.28000000000000003,0.28000000000000003,0.28999999999999998,0.24,0.18,0.26,0.25,0.14000000000000001]
["Cyprus",0.22,0.32,0.3,0.24,0.25,0.24,0.18,0.23,0.15]
["Czech Rep.",0.1,0.25,0.28000000000000003,0.14000000000000001,0.14000000000000001,0.1,0.14000000000000001,0.19,0.11]
["Estonia",0.06,0.09,0.08,0.06,0.03,0.03,0.03,7.0000000000000007E-2,0.02]
["FYR Macedonia",0,0,0,0,0,0,0,0,0]
["Georgia",0.06,0.09,0.08,7.0000000000000007E-2,0.06,0.05,0.06,7.0000000000000007E-2,0.04]
["Germany",7.0000000000000007E-2,0.06,0.06,0.06,0.06,0.04,0.04,0.33,0.09]
["Greece",0.27,0.49,0.41,0.3,0.37,0.12,0.17,0.26,0.17]
["Hungary",0.3,0.32,0.28999999999999998,0.16,0.23,0.17,0.19,0.27,0.18]
["Italy",0.22,0.46,0.4,0.32,0.27,0.11,0.18,0.23,0.16]
["Kazakhstan",0.11,0.15,0.23,0.24,0.24,0.35,0.28000000000000003,0.28999999999999998,0.12]
["Kosovo",0.4,0.46,0.46,0.42,0.35,0.18,0.4,0.3,0.17]
["Kyrgyz Rep.",0.35,0.5,0.54,0.51,0.54,0.59,0.62,0.52,0.25]
["Latvia",0.14000000000000001,0.23,0.21,0.14000000000000001,0.15,0.18,0.13,0.12,7.0000000000000007E-2]
["Lithuania",0.13,0.19,0.16,0.14000000000000001,0.14000000000000001,0.14000000000000001,0.2,0.17,0.09]
["Moldova",0,0,0,0,0,0,0,0,0]
["Mongolia",0.34,0.46,0.39,0.28999999999999998,0.3,0.28000000000000003,0.27,0.24,0.11]
["Montenegro",0.18,0.18,0.2,0.17,0.18,0.19,0.17,0.2,0.11]
["Poland",0.09,0.15,0.16,0.13,0.13,0.11,0.13,0.14000000000000001,7.0000000000000007E-2]
["Romania",0.31,0.54,0.47,0.38,0.33,0.3,0.32,0.28999999999999998,0.28999999999999998]
["Russia",0.11,0.18,0.38,0.33,0.26,0.32,0.24,0.26,0.13]
["Serbia",0.27,0.28000000000000003,0.32,0.33,0.34,0.33,0.32,0.35,0.2]
["Slovak Rep.",0.39,0.43,0.38,0.26,0.28000000000000003,0.28999999999999998,0.4,0.28000000000000003,0.24]
["Slovenia",0.17,0.25,0.23,0.19,0.19,0.09,0.18,0.17,0.15]
["Tajikistan",0.03,0.06,0.1,0.12,0.17,0.18,0.14000000000000001,0.13,7.0000000000000007E-2]
["Turkey",0.38,0.4,0.41,0.38,0.39,0.32,0.36,0.35,0.33]
["Ukraine",0,0,0,0,0,0,0,0,0]
[]
[]
["Pivot table:"]
["PT5"]
["Country","Montenegro"]
[null,null,null,null,null,null,"Ranking","Ranking2","Extrac pivot table values",null,null,"ORDER",null,"This is what is added into the methodology note"]
["Values",null,null,null,null,null,{"$f":"+RANK(J253,$J$253:$J$261,0)","v":4},{"$f":"SUM(1*(J253>$J$253:$J$261))+1+IF(ROW(J253)-ROW($J$253)=0,0,SUM(1*(J253=OFFSET($J$253,0,0,INDEX(ROW(J253)-ROW($J$253)+1,1)-1,1))))","v":4},{"$f":"A254","v":"Sum of 1"},{"$f":"B254","v":0.18},null,1,{"$f":"+VLOOKUP(L253,$H$253:$I$262,2,FALSE)","v":"Sum of 9"},{"$f":"+VLOOKUP(M253,$I$253:$J$261,2,FALSE)","v":0.11},{"$f":"+VLOOKUP(M253,$A$266:$B$275,2,FALSE)","v":"Religious leaders"}]
["Sum of 1",0.18,null,null,null,null,{"$f":"+RANK(J254,$J$253:$J$261,0)","v":4},{"$f":"SUM(1*(J254>$J$253:$J$261))+1+IF(ROW(J254)-ROW($J$253)=0,0,SUM(1*(J254=OFFSET($J$253,0,0,INDEX(ROW(J254)-ROW($J$253)+1,1)-1,1))))","v":5},{"$f":"A255","v":"Sum of 2"},{"$f":"B255","v":0.18},null,2,{"$f":"+VLOOKUP(L254,$H$253:$I$262,2,FALSE)","v":"Sum of 4"},{"$f":"+VLOOKUP(M254,$I$253:$J$261,2,FALSE)","v":0.17},"Local government representatives"]
["Sum of 2",0.18,null,null,null,null,{"$f":"+RANK(J255,$J$253:$J$262,0)","v":1},{"$f":"SUM(1*(J255>$J$253:$J$261))+1+IF(ROW(J255)-ROW($J$253)=0,0,SUM(1*(J255=OFFSET($J$253,0,0,INDEX(ROW(J255)-ROW($J$253)+1,1)-1,1))))","v":8},"Sum of 3",0.2,null,3,{"$f":"+VLOOKUP(L255,$H$253:$I$261,2,FALSE)","v":"Sum of 7"},0.17,"Judges and Magistrates"]
["Sum of 3",0.2,null,null,null,null,7,{"$f":"SUM(1*(J256>$J$253:$J$261))+1+IF(ROW(J256)-ROW($J$253)=0,0,SUM(1*(J256=OFFSET($J$253,0,0,INDEX(ROW(J256)-ROW($J$253)+1,1)-1,1))))","v":2},"Sum of 4",0.17,null,4,{"$f":"+VLOOKUP(L256,$H$253:$I$262,2,FALSE)","v":"Sum of 1"},0.18,"President/Prime Minister"]
["Sum of 4",0.17,null,null,null,null,4,{"$f":"SUM(1*(J257>$J$253:$J$261))+1+IF(ROW(J257)-ROW($J$253)=0,0,SUM(1*(J257=OFFSET($J$253,0,0,INDEX(ROW(J257)-ROW($J$253)+1,1)-1,1))))","v":6},"Sum of 5",0.18,null,5,{"$f":"+VLOOKUP(L257,$H$253:$I$262,2,FALSE)","v":"Sum of 2"},0.18,"Parliament"]
["Sum of 5",0.18,null,null,null,null,3,{"$f":"SUM(1*(J258>$J$253:$J$261))+1+IF(ROW(J258)-ROW($J$253)=0,0,SUM(1*(J258=OFFSET($J$253,0,0,INDEX(ROW(J258)-ROW($J$253)+1,1)-1,1))))","v":7},"Sum of 6",0.19,null,6,{"$f":"+VLOOKUP(L258,$H$253:$I$261,2,FALSE)","v":"Sum of 5"},0.18,"Tax officials"]
["Sum of 6",0.19,null,null,null,null,7,{"$f":"SUM(1*(J259>$J$253:$J$261))+1+IF(ROW(J259)-ROW($J$253)=0,0,SUM(1*(J259=OFFSET($J$253,0,0,INDEX(ROW(J259)-ROW($J$253)+1,1)-1,1))))","v":3},"Sum of 7",0.17,null,7,{"$f":"+VLOOKUP(L259,$H$253:$I$262,2,FALSE)","v":"Sum of 6"},0.19,"Police"]
["Sum of 7",0.17,null,null,null,null,1,{"$f":"SUM(1*(J260>$J$253:$J$261))+1+IF(ROW(J260)-ROW($J$253)=0,0,SUM(1*(J260=OFFSET($J$253,0,0,INDEX(ROW(J260)-ROW($J$253)+1,1)-1,1))))","v":9},"Sum of 8",0.2,null,8,{"$f":"+VLOOKUP(L260,$H$253:$I$262,2,FALSE)","v":"Sum of 3"},0.2,"Government officials"]
["Sum of 8",0.2,null,null,null,null,9,{"$f":"SUM(1*(J261>$J$253:$J$261))+1+IF(ROW(J261)-ROW($J$253)=0,0,SUM(1*(J261=OFFSET($J$253,0,0,INDEX(ROW(J261)-ROW($J$253)+1,1)-1,1))))","v":1},"Sum of 9",0.11,null,9,{"$f":"+VLOOKUP(L261,$H$253:$I$261,2,FALSE)","v":"Sum of 8"},0.2,"Business executives"]
["Sum of 9",0.11]
[]
[null,null,null,null,null,null,null,null,null,null,null,null,null,null,"Just for the graph:"]
[null,"LABELS",null,null,null,null,null,null,null,null,null,null,null,null,{"$f":"O253","v":"Religious leaders"},{"$f":"N253","v":0.11}]
["Sum of 1","President/Prime Minister",null,null,null,null,null,null,null,null,null,null,null,null,{"$f":"O254","v":"Local government representatives"},{"$f":"N254","v":0.17}]
["Sum of 2","Parliament",null,null,null,null,null,null,null,null,null,null,null,null,"Judges and Magistrates",{"$f":"N255","v":0.17}]
["Sum of 3","Government officials",null,null,null,null,null,null,null,null,null,null,null,null,"President/Prime Minister",0.18]
["Sum of 4","Local government representatives",null,null,null,null,null,null,null,null,null,null,null,null,"Parliament",0.18]
["Sum of 5","Tax officials",null,null,null,null,null,null,null,null,null,null,null,null,"Tax officials",0.18]
["Sum of 6","Police",null,null,null,null,null,null,null,null,null,null,null,null,"Police",0.19]
["Sum of 7","Judges and Magistrates",null,null,null,null,null,null,null,null,null,null,null,null,"Government officials",0.2]
["Sum of 8","Business executives",null,null,null,null,null,null,null,null,null,null,null,null,{"$f":"O261","v":"Business executives"},0.2]
["Sum of 9","Religious leaders"]
[null,"NEW LABEL"]